BDBM46367 4-(1,3-benzothiazol-2-yl)-N-(4-methylsulfanylphenyl)piperazine-1-carboxamide::4-(1,3-benzothiazol-2-yl)-N-[4-(methylthio)phenyl]-1-piperazinecarboxamide::4-(1,3-benzothiazol-2-yl)-N-[4-(methylthio)phenyl]piperazine-1-carboxamide::MLS000520589::SMR000131000::cid_9550815
SMILES CSc1ccc(NC(=O)N2CCN(CC2)c2nc3ccccc3s2)cc1
InChI Key InChIKey=CCFJVQJFPXUOIA-UHFFFAOYSA-N
Data  2 IC50
  Tab Delimited (TSV)   2D SDfile   Computed 3D by Vconf -m prep SDfile
Find this compound or compounds like it in BindingDB:
Activity Spreadsheet -- Enzyme Inhibition Constant Data from BindingDB
Found 2 hits for monomerid = 46367
TargetSignal transducer and activator of transcription 1-alpha/beta(Homo sapiens (Human))
The Scripps Research Institute Molecular Screening Center
Curated by PubChem BioAssay
LigandPNGBDBM46367(4-(1,3-benzothiazol-2-yl)-N-(4-methylsulfanylpheny...)
Affinity DataIC50: >5.57E+4nM. Assay description: Source (MLPCN Center Name): The Scripps Research Institute Molecular Screening Center Center Affiliation: The Scripps Research Institute (TSRI) Assay...
In DepthDetails PCBioAssay
TargetSignal transducer and activator of transcription 3 [702-738,740-752](Homo sapiens (Human))
The Scripps Research Institute Molecular Screening Center
Curated by PubChem BioAssay
LigandPNGBDBM46367(4-(1,3-benzothiazol-2-yl)-N-(4-methylsulfanylpheny...)
Affinity DataIC50:  5.97E+3nM. Assay description: Source (MLPCN Center Name): The Scripps Research Institute Molecular Screening Center Center Affiliation: The Scripps Research Institute (TSRI) Assay...
In DepthDetails PCBioAssay