BDBM46410 4-(5-heptyl-1H-pyridin-2-ylidene)-1-cyclohexa-2,5-dienone::4-(5-heptyl-1H-pyridin-2-ylidene)cyclohexa-2,5-dien-1-one::MLS000713796::SMR000273277::cid_5342163
SMILES CCCCCCCc1ccc(nc1)-c1ccc(O)cc1
InChI Key InChIKey=JZFVMTKUEHVOSZ-UHFFFAOYSA-N
Data  2 IC50
  Tab Delimited (TSV)   2D SDfile   Computed 3D by Vconf -m prep SDfile
Find this compound or compounds like it in BindingDB:
Activity Spreadsheet -- Enzyme Inhibition Constant Data from BindingDB
Found 2 hits for monomerid = 46410
TargetSignal transducer and activator of transcription 1-alpha/beta(Homo sapiens (Human))
The Scripps Research Institute Molecular Screening Center
Curated by PubChem BioAssay
LigandPNGBDBM46410(4-(5-heptyl-1H-pyridin-2-ylidene)-1-cyclohexa-2,5-...)
Affinity DataIC50: >5.57E+4nM. Assay description: Source (MLPCN Center Name): The Scripps Research Institute Molecular Screening Center Center Affiliation: The Scripps Research Institute (TSRI) Assay...
In DepthDetails PCBioAssay
TargetSignal transducer and activator of transcription 3 [702-738,740-752](Homo sapiens (Human))
The Scripps Research Institute Molecular Screening Center
Curated by PubChem BioAssay
LigandPNGBDBM46410(4-(5-heptyl-1H-pyridin-2-ylidene)-1-cyclohexa-2,5-...)
Affinity DataIC50:  3.26E+3nM. Assay description: Source (MLPCN Center Name): The Scripps Research Institute Molecular Screening Center Center Affiliation: The Scripps Research Institute (TSRI) Assay...
In DepthDetails PCBioAssay