BDBM465 (6S)-3-[(4-amino-2-tert-butyl-5-methylphenyl)sulfanyl]-4-hydroxy-6-[2-(4-hydroxyphenyl)ethyl]-6-(propan-2-yl)-5,6-dihydro-2H-pyran-2-one::CHEMBL2114404::Dihydropyran-2-one deriv. 70
SMILES CC(C)[C@]1(CCc2ccc(O)cc2)CC(=O)C(Sc2cc(C)c(N)cc2C(C)(C)C)C(=O)O1
InChI Key InChIKey=HPYCGBSIYDCTOZ-WKDCXCOVSA-N
Data  4 KI
  Tab Delimited (TSV)   2D SDfile   Computed 3D by Vconf -m prep SDfile
Find this compound or compounds like it in BindingDB:
Activity Spreadsheet -- Enzyme Inhibition Constant Data from BindingDB
Found 4 hits for monomerid = 465
TargetDimer of Gag-Pol polyprotein [489-587](Human immunodeficiency virus type 1)
Parke-Davis Pharmaceutical Research
LigandPNGBDBM465((6S)-3-[(4-amino-2-tert-butyl-5-methylphenyl)sulfa...)
Affinity DataKi:  0.0700nM. Assay description: Sensitivity of HIV-1 protease activity to protease inhibitors was determined by a peptide substrate cleavage assay. Protease products were analyzed o...
In DepthDetails ArticlePubMed
TargetGag-Pol polyprotein [489-587](Human immunodeficiency virus type 1)
Warner-Lambert
Curated by ChEMBL
LigandPNGBDBM465((6S)-3-[(4-amino-2-tert-butyl-5-methylphenyl)sulfa...)
Affinity DataKi:  0.0700nM. Assay description: Binding affinity of the compound towards HIV protease was determined
In DepthDetails ArticlePubMed
TargetGag-Pol polyprotein [489-587](Human immunodeficiency virus type 1)
Warner-Lambert
Curated by ChEMBL
LigandPNGBDBM465((6S)-3-[(4-amino-2-tert-butyl-5-methylphenyl)sulfa...)
Affinity DataKi:  0.0700nMpH: 6.2Assay Description:Binding affinity of the compound towards HIV protease was determined
In DepthDetails ArticlePubMed
TargetGag-Pol polyprotein [489-587](Human immunodeficiency virus type 1)
Warner-Lambert
Curated by ChEMBL
LigandPNGBDBM465((6S)-3-[(4-amino-2-tert-butyl-5-methylphenyl)sulfa...)
Affinity DataKi:  13nM. Assay description: Tested for binding affinity against HIV protease
In DepthDetails ArticlePubMed