BDBM46510 (3aS,6aS)-3a-methyl-5,5-bis(oxidanylidene)-3-phenyl-6,6a-dihydro-4H-thieno[3,4-d][1,3]thiazole-2-thione::(3aS,6aS)-3a-methyl-5,5-dioxo-3-phenyl-6,6a-dihydro-4H-thieno[3,4-d][1,3]thiazole-2-thione::(3aS,6aS)-3a-methyl-5,5-dioxo-3-phenyl-6,6a-dihydro-4H-thieno[3,4-d]thiazole-2-thione::(3aS,6aS)-5,5-diketo-3a-methyl-3-phenyl-6,6a-dihydro-4H-thieno[3,4-d]thiazole-2-thione::MLS001049375::SMR000427336::cid_6552971
SMILES C[C@]12CS(=O)(=O)C[C@H]1SC(=S)N2c1ccccc1
InChI Key InChIKey=FIIWHQCDYPZZLN-PWSUYJOCSA-N
Data  2 EC50
  Tab Delimited (TSV)   2D SDfile   Computed 3D by Vconf -m prep SDfile
Find this compound or compounds like it in BindingDB:
Activity Spreadsheet -- Enzyme Inhibition Constant Data from BindingDB
Found 2 hits for monomerid = 46510
TargetEukaryotic translation initiation factor 2-alpha kinase 3(Homo sapiens (Human))
The Scripps Research Institute Molecular Screening Center
Curated by PubChem BioAssay
LigandPNGBDBM46510((3aS,6aS)-3a-methyl-5,5-bis(oxidanylidene)-3-pheny...)
Affinity DataEC50: >5.57E+4nM. Assay description: Source (MLPCN Center Name): The Scripps Research Institute Molecular Screening Center (SRIMSC) Center Affiliation: The Scripps Research Institute (TS...
In DepthDetails PCBioAssay
TargetEukaryotic translation initiation factor 2-alpha kinase 3(Homo sapiens (Human))
The Scripps Research Institute Molecular Screening Center
Curated by PubChem BioAssay
LigandPNGBDBM46510((3aS,6aS)-3a-methyl-5,5-bis(oxidanylidene)-3-pheny...)
Affinity DataEC50: >5.57E+4nM. Assay description: Source (MLPCN Center Name): The Scripps Research Institute Molecular Screening Center (SRIMSC) Center Affiliation: The Scripps Research Institute (TS...
In DepthDetails PCBioAssay