BDBM46526 2-chloranyl-N-(4-methylpyridin-2-yl)-5-(trifluoromethyl)benzenesulfonamide::2-chloro-N-(4-methyl-2-pyridinyl)-5-(trifluoromethyl)benzenesulfonamide::2-chloro-N-(4-methyl-2-pyridyl)-5-(trifluoromethyl)benzenesulfonamide::2-chloro-N-(4-methylpyridin-2-yl)-5-(trifluoromethyl)benzenesulfonamide::MLS001002401::SMR000368963::cid_2100855
SMILES Cc1ccnc(NS(=O)(=O)c2cc(ccc2Cl)C(F)(F)F)c1
InChI Key InChIKey=ILNFEUPFQANRKC-UHFFFAOYSA-N
Data  2 EC50
  Tab Delimited (TSV)   2D SDfile   Computed 3D by Vconf -m prep SDfile
Find this compound or compounds like it in BindingDB:
Activity Spreadsheet -- Enzyme Inhibition Constant Data from BindingDB
Found 2 hits for monomerid = 46526
TargetEukaryotic translation initiation factor 2-alpha kinase 3(Homo sapiens (Human))
The Scripps Research Institute Molecular Screening Center
Curated by PubChem BioAssay
LigandPNGBDBM46526(2-chloranyl-N-(4-methylpyridin-2-yl)-5-(trifluorom...)
Affinity DataEC50: >5.57E+4nM. Assay description: Source (MLPCN Center Name): The Scripps Research Institute Molecular Screening Center (SRIMSC) Center Affiliation: The Scripps Research Institute (TS...
In DepthDetails PCBioAssay
TargetEukaryotic translation initiation factor 2-alpha kinase 3(Homo sapiens (Human))
The Scripps Research Institute Molecular Screening Center
Curated by PubChem BioAssay
LigandPNGBDBM46526(2-chloranyl-N-(4-methylpyridin-2-yl)-5-(trifluorom...)
Affinity DataEC50: >5.57E+4nM. Assay description: Source (MLPCN Center Name): The Scripps Research Institute Molecular Screening Center (SRIMSC) Center Affiliation: The Scripps Research Institute (TS...
In DepthDetails PCBioAssay