BDBM46552 2-methoxybenzoic acid (5-amino-1-tosyl-pyrazol-3-yl) ester::2-methoxybenzoic acid [5-amino-1-(4-methylphenyl)sulfonyl-3-pyrazolyl] ester::5-amino-1-[(4-methylphenyl)sulfonyl]-1H-pyrazol-3-yl 2-methoxybenzoate::MLS000086036::SMR000021564::[5-amino-1-(4-methylphenyl)sulfonylpyrazol-3-yl] 2-methoxybenzoate::[5-azanyl-1-(4-methylphenyl)sulfonyl-pyrazol-3-yl] 2-methoxybenzoate::cid_3244315
SMILES COc1ccccc1C(=O)Oc1cc(N)n(n1)S(=O)(=O)c1ccc(C)cc1
InChI Key InChIKey=KGJOEFLJJDLLOW-UHFFFAOYSA-N
Data  3 IC50
  Tab Delimited (TSV)   2D SDfile   Computed 3D by Vconf -m prep SDfile
Find this compound or compounds like it in BindingDB:
Activity Spreadsheet -- Enzyme Inhibition Constant Data from BindingDB
Found 3 hits for monomerid = 46552
TargetTransitional endoplasmic reticulum ATPase(Homo sapiens (Human))
The Scripps Research Institute Molecular Screening Center
Curated by PubChem BioAssay
LigandPNGBDBM46552(2-methoxybenzoic acid (5-amino-1-tosyl-pyrazol-3-y...)
Affinity DataIC50: >5.00E+4nM. Assay description: Source (MLPCN Center Name): The Scripps Research Institute Molecular Screening Center Center Affiliation: The Scripps Research Institute (TSRI) Assay...
In DepthDetails PCBioAssay
TargetM1 family aminopeptidase(Plasmodium falciparum (isolate FcB1 / Columbia))
Srmlsc
Curated by PubChem BioAssay
LigandPNGBDBM46552(2-methoxybenzoic acid (5-amino-1-tosyl-pyrazol-3-y...)
Affinity DataIC50:  9.99E+4nM. Assay description: Southern Research Molecular Libraries Screening Center (SRMLSC) Southern Research Institute (Birmingham, Alabama) NIH Molecular Libraries Screening...
In DepthDetails PCBioAssay
TargetTransitional endoplasmic reticulum ATPase(Homo sapiens (Human))
The Scripps Research Institute Molecular Screening Center
Curated by PubChem BioAssay
LigandPNGBDBM46552(2-methoxybenzoic acid (5-amino-1-tosyl-pyrazol-3-y...)
Affinity DataIC50: >5.00E+4nM. Assay description: Source (MLPCN Center Name): The Scripps Research Institute Molecular Screening Center Center Affiliation: The Scripps Research Institute (TSRI) Assay...
In DepthDetails PCBioAssay