BDBM465562 US10793568, Compound I-212
SMILES Clc1cccc(Cl)c1-c1noc(C2CC2)c1CO[C@@H]1C[C@@H]2C[C@H]1CN2c1ccc(cc1)C(=O)NS(=O)(=O)CCOC(=O)C1CC1
InChI Key InChIKey=LBTBMNDYUWEFRN-JEYPMZLKSA-N
Data  1 EC50
  Tab Delimited (TSV)   2D SDfile   Computed 3D by Vconf -m prep SDfile
Find this compound or compounds like it in BindingDB:
Activity Spreadsheet -- Enzyme Inhibition Constant Data from BindingDB
Found 1 hit for monomerid = 465562
TargetBile acid receptor(Homo sapiens (Human))
Ardelyx
US Patent
LigandPNGBDBM465562(US10793568, Compound I-212)
Affinity DataEC50:  0.631nM. Assay description: The affinity of FXR ligands for the ligand binding domain of FXR was determined using a commercially available human FXR ligand binding assay (Lantha...
Ligand InfoPC cidPC sid
In DepthDetails US Patent