BDBM4664 4-Anilinoquinazoline 11::N-(4-Bromo-2-fluorophenyl)-6-methoxy-7-{[(2E)-4-pyrrolidin-1-ylbut-2-enyl]oxy}quinazolin-4-amine::N-(4-bromo-2-fluorophenyl)-6-methoxy-7-{[(2E)-4-(pyrrolidin-1-yl)but-2-en-1-yl]oxy}quinazolin-4-amine
SMILES COc1cc2c(Nc3ccc(Br)cc3F)ncnc2cc1OC\C=C\CN1CCCC1
InChI Key InChIKey=ZMAGOHAYMIZJEE-SNAWJCMRSA-N
Data  4 IC50
  Tab Delimited (TSV)   2D SDfile   Computed 3D by Vconf -m prep SDfile
Find this compound or compounds like it in BindingDB:
Activity Spreadsheet -- Enzyme Inhibition Constant Data from BindingDB
Found 4 hits for monomerid = 4664
TargetVascular endothelial growth factor receptor 1(Homo sapiens (Human))
Astrazeneca
LigandPNGBDBM4664(4-Anilinoquinazoline 11 | N-(4-Bromo-2-fluoropheny...)
Affinity DataIC50:  650nMpH: 7.4 T: 2°C. Assay description: An ELISA assay was used to determine the ability of inhibitor to inhibit VEGF-R RTK activity. The compounds were incubated with enzyme 20 min at room...
In DepthDetails ArticlePubMed
TargetEpidermal growth factor receptor(Homo sapiens (Human))
Astrazeneca
LigandPNGBDBM4664(4-Anilinoquinazoline 11 | N-(4-Bromo-2-fluoropheny...)
Affinity DataIC50:  100nMT: 2°C. Assay description: An ELISA assay was used to determine the ability of inhibitor to inhibit EGF-R RTK activity. The compounds were incubated with enzyme 20 min at room ...
In DepthDetails ArticlePubMed
TargetFibroblast growth factor receptor 1(Homo sapiens (Human))
Astrazeneca
LigandPNGBDBM4664(4-Anilinoquinazoline 11 | N-(4-Bromo-2-fluoropheny...)
Affinity DataIC50:  2.10E+3nMT: 2°C. Assay description: An ELISA assay was used to determine the ability of inhibitor to inhibit FGFR-1 TK activity. The compounds were incubated with enzyme 20 min at room ...
In DepthDetails ArticlePubMed
TargetVascular endothelial growth factor receptor 2(Homo sapiens (Human))
Astrazeneca
LigandPNGBDBM4664(4-Anilinoquinazoline 11 | N-(4-Bromo-2-fluoropheny...)
Affinity DataIC50:  8nMT: 2°C. Assay description: An ELISA assay was used to determine the ability of inhibitor to inhibit VEGF-R RTK activity. The compounds were incubated with enzyme 20 min at room...
In DepthDetails ArticlePubMed