BDBM46729 (4-chlorodithiazol-5-ylidene)-(2-methoxyethyl)amine::4-chloranyl-N-(2-methoxyethyl)-1,2,3-dithiazol-5-imine::4-chloro-N-(2-methoxyethyl)-5-dithiazolimine::4-chloro-N-(2-methoxyethyl)dithiazol-5-imine::MLS-0390941.0001::cid_25199534
SMILES COCC\N=c1/ssnc1Cl
InChI Key InChIKey=MUBCMDNJTHSHSB-ALCCZGGFSA-N
Data  2 IC50
  Tab Delimited (TSV)   2D SDfile   Computed 3D by Vconf -m prep SDfile
Find this compound or compounds like it in BindingDB:
Activity Spreadsheet -- Enzyme Inhibition Constant Data from BindingDB
Found 2 hits for monomerid = 46729
TargetMannose-6-phosphate isomerase(Homo sapiens (Human))
Burnham Center For Chemical Genomics
Curated by PubChem BioAssay
LigandPNGBDBM46729((4-chlorodithiazol-5-ylidene)-(2-methoxyethyl)amin...)
Affinity DataIC50:  1.19E+4nM. Assay description: Data Source: Sanford-Burnham Center for Chemical Genomics (SBCCG) Source Affiliation: Sanford-Burnham Medical Research Institute (SBMRI, San Diego, C...
Ligand InfoPC cidPC sid
In DepthDetails PCBioAssay
TargetPhosphomannomutase 2(Homo sapiens (Human))
Burnham Center For Chemical Genomics
Curated by PubChem BioAssay
LigandPNGBDBM46729((4-chlorodithiazol-5-ylidene)-(2-methoxyethyl)amin...)
Affinity DataIC50: >1.00E+5nM. Assay description: Data Source: Sanford-Burnham Center for Chemical Genomics (SBCCG) Source Affiliation: Sanford-Burnham Medical Research Institute (SBMRI, San Diego, C...
Ligand InfoPC cidPC sid
In DepthDetails PCBioAssay