BDBM4679 4-Anilinoquinazoline 26::N-(4-chloro-2-fluorophenyl)-6-methoxy-7-[2-(1-methylpiperidin-4-yl)ethoxy]quinazolin-4-amine
SMILES COc1cc2c(Nc3ccc(Cl)cc3F)ncnc2cc1OCCC1CCN(C)CC1
InChI Key InChIKey=VEOIWTSZBRXBQG-UHFFFAOYSA-N
Data  4 IC50
  Tab Delimited (TSV)   2D SDfile   Computed 3D by Vconf -m prep SDfile
Find this compound or compounds like it in BindingDB:
Activity Spreadsheet -- Enzyme Inhibition Constant Data from BindingDB
Found 4 hits for monomerid = 4679
TargetVascular endothelial growth factor receptor 1(Homo sapiens (Human))
Astrazeneca
LigandPNGBDBM4679(4-Anilinoquinazoline 26 | N-(4-chloro-2-fluorophen...)
Affinity DataIC50:  500nMT: 2°C. Assay description: An ELISA assay was used to determine the ability of inhibitor to inhibit VEGF-R RTK activity. The compounds were incubated with enzyme 20 min at room...
In DepthDetails ArticlePubMed
TargetEpidermal growth factor receptor(Homo sapiens (Human))
Astrazeneca
LigandPNGBDBM4679(4-Anilinoquinazoline 26 | N-(4-chloro-2-fluorophen...)
Affinity DataIC50:  300nMT: 2°C. Assay description: An ELISA assay was used to determine the ability of inhibitor to inhibit EGF-R RTK activity. The compounds were incubated with enzyme 20 min at room ...
In DepthDetails ArticlePubMed
TargetFibroblast growth factor receptor 1(Homo sapiens (Human))
Astrazeneca
LigandPNGBDBM4679(4-Anilinoquinazoline 26 | N-(4-chloro-2-fluorophen...)
Affinity DataIC50:  4.10E+3nMT: 2°C. Assay description: An ELISA assay was used to determine the ability of inhibitor to inhibit FGFR-1 TK activity. The compounds were incubated with enzyme 20 min at room ...
In DepthDetails ArticlePubMed
TargetVascular endothelial growth factor receptor 2(Homo sapiens (Human))
Astrazeneca
LigandPNGBDBM4679(4-Anilinoquinazoline 26 | N-(4-chloro-2-fluorophen...)
Affinity DataIC50:  55nMT: 2°C. Assay description: An ELISA assay was used to determine the ability of inhibitor to inhibit VEGF-R RTK activity. The compounds were incubated with enzyme 20 min at room...
In DepthDetails ArticlePubMed