BDBM469586 Compound 1-18::US11072585, Example 11
SMILES CN(C)[C@]1(CC[C@]2(CN(C(=O)N2)c2cnc(nc2)C(F)(F)F)CC1)c1nc2ccccc2n1C
InChI Key InChIKey=BCWCCUAURYQHCZ-SZPZYZBQSA-N
Data  1 IC50
  Tab Delimited (TSV)   2D SDfile   Computed 3D by Vconf -m prep SDfile
Find this compound or compounds like it in BindingDB:
Activity Spreadsheet -- Enzyme Inhibition Constant Data from BindingDB
Found 1 hit for monomerid = 469586
TargetLysyl oxidase homolog 2(Homo sapiens (Human))
Pharmakea
US Patent
LigandPNGBDBM469586(Compound 1-18 | US11072585, Example 11)
Affinity DataIC50: <300nM. Assay description: LOXL2 amine oxidase activity is evaluated by measuring Amplex Red fluorescence using 10-20× concentrated conditioned media from CHO cells stably expr...
Ligand InfoPC cidPC sid
In DepthDetails US Patent