BDBM46989 4-(4-piperidinosulfonylphenyl)-5-(trifluoromethyl)thiophene-2-carboxylic acid methyl ester::4-[4-(1-piperidinylsulfonyl)phenyl]-5-(trifluoromethyl)-2-thiophenecarboxylic acid methyl ester::MLS000850154::SMR000456172::cid_2811106::methyl 4-(4-piperidin-1-ylsulfonylphenyl)-5-(trifluoromethyl)thiophene-2-carboxylate::methyl 4-[4-(piperidinosulfonyl)phenyl]-5-(trifluoromethyl)-2-thiophenecarboxylate
SMILES COC(=O)c1cc(c(s1)C(F)(F)F)-c1ccc(cc1)S(=O)(=O)N1CCCCC1
InChI Key InChIKey=FSYNOCBAAFALTL-UHFFFAOYSA-N
Data  2 EC50
  Tab Delimited (TSV)   2D SDfile   Computed 3D by Vconf -m prep SDfile
Find this compound or compounds like it in BindingDB:
Activity Spreadsheet -- Enzyme Inhibition Constant Data from BindingDB
Found 2 hits for monomerid = 46989
TargetIon channel NompC(Danio rerio)
The Scripps Research Institute Molecular Screening Center
Curated by PubChem BioAssay
LigandPNGBDBM46989(4-(4-piperidinosulfonylphenyl)-5-(trifluoromethyl)...)
Affinity DataEC50:  2.99E+4nM. Assay description: Source (MLPCN Center Name): The Scripps Research Institute Molecular Screening Center (SRIMSC) Center Affiliation: The Scripps Research Institute (TS...
In DepthDetails PCBioAssay
TargetMucolipin-3(Homo sapiens (Human))
The Scripps Research Institute Molecular Screening Center
Curated by PubChem BioAssay
LigandPNGBDBM46989(4-(4-piperidinosulfonylphenyl)-5-(trifluoromethyl)...)
Affinity DataEC50: >2.99E+4nM. Assay description: Source (MLPCN Center Name): The Scripps Research Institute Molecular Screening Center (SRIMSC) Center Affiliation: The Scripps Research Institute (TS...
In DepthDetails PCBioAssay