BDBM47021 4-[2-[(E)-2-cyanoethenyl]anilino]benzenesulfonamide::4-[2-[(E)-2-cyanovinyl]anilino]benzenesulfonamide::4-[[2-[(E)-2-cyanoethenyl]phenyl]amino]benzenesulfonamide::SR-03000000672-1::cid_25110543
SMILES NS(=O)(=O)c1ccc(Nc2ccccc2\C=C\C#N)cc1
InChI Key InChIKey=GESMYMURWHCPQS-HWKANZROSA-N
Data  1 IC50
  Tab Delimited (TSV)   2D SDfile   Computed 3D by Vconf -m prep SDfile
Find this compound or compounds like it in BindingDB:
Activity Spreadsheet -- Enzyme Inhibition Constant Data from BindingDB
Found 1 hit for monomerid = 47021
TargetTransitional endoplasmic reticulum ATPase(Homo sapiens (Human))
The Scripps Research Institute Molecular Screening Center
Curated by PubChem BioAssay
LigandPNGBDBM47021(4-[2-[(E)-2-cyanoethenyl]anilino]benzenesulfonamid...)
Affinity DataIC50: >5.00E+4nM. Assay description: Source (MLPCN Center Name): The Scripps Research Institute Molecular Screening Center (SRIMSC) Center Affiliation: The Scripps Research Institute (TS...
Ligand InfoPC cidPC sid
In DepthDetails PCBioAssay