BDBM47099 US8937068, 169
SMILES CCNC(=O)Nc1ccc2ncc(nc2n1)-c1ccc(OP(O)(O)=O)c(OC)c1
InChI Key InChIKey=NYHXXAIWIWSJLZ-UHFFFAOYSA-N
Data  4 IC50
  Tab Delimited (TSV)   2D SDfile   Computed 3D by Vconf -m prep SDfile
Find this compound or compounds like it in BindingDB:
Activity Spreadsheet -- Enzyme Inhibition Constant Data from BindingDB
Found 4 hits for monomerid = 47099
TargetMitogen-activated protein kinase 1(Homo sapiens (Human))
Zentaris
US Patent
LigandPNGBDBM47099(US8937068, 169)
Affinity DataIC50:  2.70E+3nM. Assay description: The inhibitory effect of the compounds according to the invention was tested on various serine/threonine, tyrosine and lipid kinases in enzymatic ass...
In DepthDetails US Patent
TargetMitogen-activated protein kinase 8/9(Homo sapiens (Human))
Zentaris
US Patent
LigandPNGBDBM47099(US8937068, 169)
Affinity DataIC50:  9.50E+3nM. Assay description: The inhibitory effect of the compounds according to the invention was tested on various serine/threonine, tyrosine and lipid kinases in enzymatic ass...
In DepthDetails US Patent
TargetMitogen-activated protein kinase 14(Homo sapiens (Human))
Zentaris
US Patent
LigandPNGBDBM47099(US8937068, 169)
Affinity DataIC50: >1.00E+5nM. Assay description: The inhibitory effect of the compounds according to the invention was tested on various serine/threonine, tyrosine and lipid kinases in enzymatic ass...
In DepthDetails US Patent
LigandPNGBDBM47099(US8937068, 169)
Affinity DataIC50:  3.70E+3nM. Assay description: The inhibitory effect of the compounds according to the invention was tested on various serine/threonine, tyrosine and lipid kinases in enzymatic ass...
In DepthDetails US Patent