BDBM473063 US10836769, Example 49
SMILES Cc1c(C(=O)Nc2ccc(F)c(c2)C(F)F)c2CCCn2c1C(=O)C(=O)NC1(CC(F)(F)C1)c1nncs1
InChI Key InChIKey=HVELDAQNDJQPBF-UHFFFAOYSA-N
Data  1 EC50
  Tab Delimited (TSV)   2D SDfile   Computed 3D by Vconf -m prep SDfile
Find this compound or compounds like it in BindingDB:
Activity Spreadsheet -- Enzyme Inhibition Constant Data from BindingDB
Found 1 hit for monomerid = 473063
TargetCapsid protein(Hepatitis B virus genotype C subtype ayr (isolate ...)
Gilead Sciences
US Patent
LigandPNGBDBM473063(US10836769, Example 49)
Affinity DataEC50:  3.20nM. Assay description: A HepG2 cell line overexpressing the HBV virus attachment receptor sodium-taurocholate cotransporting polypeptide (NTCP) was grown to confluency in D...
Ligand InfoPC cidPC sid
In DepthDetails US Patent