BDBM4733 5-Acetylamino-6-aminopyridine-2-carboxylic acid::6-amino-5-acetamidopyridine-2-carboxylic acid::pyridine deriv. 34
SMILES CC(=O)Nc1ccc(nc1N)C(O)=O
InChI Key InChIKey=KPAKLTBYPQSGHN-UHFFFAOYSA-N
Data  2 IC50
  Tab Delimited (TSV)   2D SDfile   Computed 3D by Vconf -m prep SDfile
Find this compound or compounds like it in BindingDB:
Activity Spreadsheet -- Enzyme Inhibition Constant Data from BindingDB
Found 2 hits for monomerid = 4733
TargetTrans-sialidase(Trypanosoma cruzi)
University Of Manchester
Curated by ChEMBL
LigandPNGBDBM4733(5-Acetylamino-6-aminopyridine-2-carboxylic acid | ...)
Affinity DataIC50:  4.40E+5nM. Assay description: Inhibition of Trypanosoma cruzi trans-Sialidase
In DepthDetails ArticlePubMed
TargetNeuraminidase(Influenza A virus (N9))
Biocryst Pharmaceuticals
LigandPNGBDBM4733(5-Acetylamino-6-aminopyridine-2-carboxylic acid | ...)
Affinity DataIC50:  3.00E+6nMpH: 6.5 T: 2°C. Assay description: A standard fluorimetric assay was used to measure influenza virus neuraminidase activity. The substrate 2 -(4-methylumbelliferyl)-alpha-D-acetylneura...
In DepthDetails ArticlePubMed