BDBM4737 4-amino-6-carbamimidamido-5-acetamidopyridine-2-carboxylic acid::pyridine deriv. 51
SMILES [#6]-[#6](=O)-[#7]-c1c(-[#7])cc(nc1\[#7]=[#6](/[#7])-[#7])-[#6](-[#8])=O
InChI Key InChIKey=OTYOERJVFOHISU-UHFFFAOYSA-N
Data  1 IC50
  Tab Delimited (TSV)   2D SDfile   Computed 3D by Vconf -m prep SDfile
Find this compound or compounds like it in BindingDB:
Activity Spreadsheet -- Enzyme Inhibition Constant Data from BindingDB
Found 1 hit for monomerid = 4737
TargetNeuraminidase(Influenza A virus (N9))
Biocryst Pharmaceuticals
LigandPNGBDBM4737(4-amino-6-carbamimidamido-5-acetamidopyridine-2-ca...)
Affinity DataIC50:  4.00E+3nMpH: 6.5 T: 2°C. Assay description: A standard fluorimetric assay was used to measure influenza virus neuraminidase activity. The substrate 2 -(4-methylumbelliferyl)-alpha-D-acetylneura...
In DepthDetails ArticlePubMed