BDBM47376 4-[1-[benzyl-[2-(2-thienyl)acetyl]amino]-2-(cyclohexylamino)-2-keto-ethyl]benzoic acid methyl ester::4-[2-(cyclohexylamino)-2-oxo-1-[(1-oxo-2-thiophen-2-ylethyl)-(phenylmethyl)amino]ethyl]benzoic acid methyl ester::UNM000011096701::cid_3191162::methyl 4-[1-[benzyl-(2-thiophen-2-ylacetyl)amino]-2-(cyclohexylamino)-2-oxoethyl]benzoate::methyl 4-[2-(cyclohexylamino)-2-oxidanylidene-1-[(phenylmethyl)-(2-thiophen-2-ylethanoyl)amino]ethyl]benzoate
SMILES COC(=O)c1ccc(cc1)C(N(Cc1ccccc1)C(=O)Cc1cccs1)C(=O)NC1CCCCC1
InChI Key InChIKey=XEYHWRWWSDHXFV-UHFFFAOYSA-N
Data  1 EC50
  Tab Delimited (TSV)   2D SDfile   Computed 3D by Vconf -m prep SDfile
Find this compound or compounds like it in BindingDB:
Activity Spreadsheet -- Enzyme Inhibition Constant Data from BindingDB
Found 1 hit for monomerid = 47376
LigandPNGBDBM47376(4-[1-[benzyl-[2-(2-thienyl)acetyl]amino]-2-(cycloh...)
Affinity DataEC50:  4.60E+3nM. Assay description: University of New Mexico Assay Overview: Assay Support:1R03MH081228-01A1 High-throughput multiplex screening for ABC transporter inhibitors PI: Rich...
In DepthDetails PCBioAssay