BDBM47419 2-(N-(2-chloro-1-oxoethyl)-3-methoxyanilino)-N-(2-phenylethyl)-2-thiophen-2-ylacetamide::2-(N-(2-chloroacetyl)-3-methoxy-anilino)-N-phenethyl-2-(2-thienyl)acetamide::2-(N-(2-chloroacetyl)-3-methoxyanilino)-N-(2-phenylethyl)-2-thiophen-2-ylacetamide::2-[(chloroacetyl)(3-methoxyphenyl)amino]-N-(2-phenylethyl)-2-thien-2-ylacetamide::2-[2-chloranylethanoyl-(3-methoxyphenyl)amino]-N-(2-phenylethyl)-2-thiophen-2-yl-ethanamide::MLS000583956::SMR000206942::cid_3689415
SMILES COc1cccc(c1)N(C(C(=O)NCCc1ccccc1)c1cccs1)C(=O)CCl
InChI Key InChIKey=ASSYJPCLSRNQGT-UHFFFAOYSA-N
Data  2 IC50
  Tab Delimited (TSV)   2D SDfile   Computed 3D by Vconf -m prep SDfile
Find this compound or compounds like it in BindingDB:
Activity Spreadsheet -- Enzyme Inhibition Constant Data from BindingDB
Found 2 hits for monomerid = 47419
TargetProtein RecA(Mycobacterium tuberculosis H37Rv)
Southern Research Specialized Biocontainment Screening Center
Curated by PubChem BioAssay
LigandPNGBDBM47419(2-(N-(2-chloro-1-oxoethyl)-3-methoxyanilino)-N-(2-...)
Affinity DataIC50:  1.91E+4nM. Assay description: Southern Research's Specialized Biocontainment Screening Center (SRSBSC) Southern Research Institute (Birmingham, Alabama) NIH Molecular Librarie...
In DepthDetails PCBioAssay
TargetTyrosine-protein kinase JAK2(Homo sapiens (Human))
The Scripps Research Institute Molecular Screening Center
Curated by PubChem BioAssay
LigandPNGBDBM47419(2-(N-(2-chloro-1-oxoethyl)-3-methoxyanilino)-N-(2-...)
Affinity DataIC50:  1.34E+3nM. Assay description: Source (MLPCN Center Name): The Scripps Research Institute Molecular Screening Center (SRIMSC) Center Affiliation: The Scripps Research Institute (TS...
In DepthDetails PCBioAssay