BDBM47436 (6E)-6-[5-(4-methoxyphenyl)-1,2-dihydropyrazol-3-ylidene]-4-methyl-1-cyclohexa-2,4-dienone::(6E)-6-[5-(4-methoxyphenyl)-1,2-dihydropyrazol-3-ylidene]-4-methyl-cyclohexa-2,4-dien-1-one::(6E)-6-[5-(4-methoxyphenyl)-1,2-dihydropyrazol-3-ylidene]-4-methylcyclohexa-2,4-dien-1-one::(6E)-6-[5-(4-methoxyphenyl)-3-pyrazolin-3-ylidene]-4-methyl-cyclohexa-2,4-dien-1-one::MLS000713614::SMR000273095::cid_5397853
SMILES COc1ccc(cc1)-c1cc(n[nH]1)-c1cc(C)ccc1O
InChI Key InChIKey=FAXASVFSGHQOHP-UHFFFAOYSA-N
Data  4 IC50  1 EC50
  Tab Delimited (TSV)   2D SDfile   Computed 3D by Vconf -m prep SDfile
Find this compound or compounds like it in BindingDB:
Activity Spreadsheet -- Enzyme Inhibition Constant Data from BindingDB
Found 5 hits for monomerid = 47436
TargetTranscription factor p65(Homo sapiens (Human))
Srmlsc
Curated by PubChem BioAssay
LigandPNGBDBM47436((6E)-6-[5-(4-methoxyphenyl)-1,2-dihydropyrazol-3-y...)
Affinity DataEC50:  1.60E+4nM. Assay description: Southern Research Molecular Libraries Screening Center (SRMLSC) Southern Research Institute (Birmingham, Alabama) NIH Molecular Libraries Screening C...
In DepthDetails PCBioAssay
TargetTyrosine-protein kinase JAK2(Homo sapiens (Human))
The Scripps Research Institute Molecular Screening Center
Curated by PubChem BioAssay
LigandPNGBDBM47436((6E)-6-[5-(4-methoxyphenyl)-1,2-dihydropyrazol-3-y...)
Affinity DataIC50:  8.76E+3nM. Assay description: Source (MLPCN Center Name): The Scripps Research Institute Molecular Screening Center (SRIMSC) Center Affiliation: The Scripps Research Institute (TS...
In DepthDetails PCBioAssay
TargetSentrin-specific protease 6(Homo sapiens (Human))
Burnham Center For Chemical Genomics
Curated by PubChem BioAssay
LigandPNGBDBM47436((6E)-6-[5-(4-methoxyphenyl)-1,2-dihydropyrazol-3-y...)
Affinity DataIC50:  1.03E+4nM. Assay description: Data Source: Sanford-Burnham Center for Chemical Genomics (SBCCG) Source Affiliation: Sanford-Burnham Medical Research Institute (SBMRI, San Diego, C...
In DepthDetails PCBioAssay
TargetSentrin-specific protease 8(Homo sapiens (Human))
Burnham Center For Chemical Genomics
Curated by PubChem BioAssay
LigandPNGBDBM47436((6E)-6-[5-(4-methoxyphenyl)-1,2-dihydropyrazol-3-y...)
Affinity DataIC50:  9.60E+3nM. Assay description: Data Source: Sanford-Burnham Center for Chemical Genomics (SBCCG) Source Affiliation: Sanford-Burnham Medical Research Institute (SBMRI, San Diego, C...
In DepthDetails PCBioAssay
TargetCaspase-3(Homo sapiens (Human))
Burnham Center For Chemical Genomics
Curated by PubChem BioAssay
LigandPNGBDBM47436((6E)-6-[5-(4-methoxyphenyl)-1,2-dihydropyrazol-3-y...)
Affinity DataIC50:  4.42E+4nM. Assay description: Data Source: Sanford-Burnham Center for Chemical Genomics (SBCCG) Source Affiliation: Sanford-Burnham Medical Research Institute (SBMRI, San Diego, C...
In DepthDetails PCBioAssay