BDBM474368 (S)-6-(bis(4-fluorophenyl)methyl)-3-bromo- 11-hydroxy-5,6-dihydro-10H- imidazo[2',1':3,4]pyrazino[1,2-b]pyridazin-10- one::US10858366, Example 47
SMILES Oc1c2-c3ncc(Br)n3C[C@H](C(c3ccc(F)cc3)c3ccc(F)cc3)n2ncc1=O
InChI Key InChIKey=RYBBBOPXGLNKOI-MRXNPFEDSA-N
Data  3 EC50
  Tab Delimited (TSV)   2D SDfile   Computed 3D by Vconf -m prep SDfile
Find this compound or compounds like it in BindingDB:
Activity Spreadsheet -- Enzyme Inhibition Constant Data from BindingDB
Found 3 hits for monomerid = 474368
TargetNeuraminidase(Influenza A virus (strain A/Wilson-Smith/1933 H1N1...)
Novartis
US Patent
LigandPNGBDBM474368((S)-6-(bis(4-fluorophenyl)methyl)-3-bromo- 11-hydr...)
Affinity DataEC50:  290nM. Assay description: For influenza NA assays, MDCK cells were plated in Phenol Red-free DMEM (Gibco) supplemented with 2 mM L-Glutamine, 1% sodium pyruvate (Cellgro, Mana...
Ligand InfoPC cidPC sid
In DepthDetails US Patent
TargetNeuraminidase()
Novartis
US Patent
LigandPNGBDBM474368((S)-6-(bis(4-fluorophenyl)methyl)-3-bromo- 11-hydr...)
Affinity DataEC50:  560nM
Ligand InfoPC cidPC sid
In DepthDetails US Patent
TargetNeuraminidase(Influenza A virus (strain A/Memphis/1/1971 H3N2))
Novartis
US Patent
LigandPNGBDBM474368((S)-6-(bis(4-fluorophenyl)methyl)-3-bromo- 11-hydr...)
Affinity DataEC50:  840nM
Ligand InfoPC cidPC sid
In DepthDetails US Patent