BDBM47514 2-furfuryl-[5-(2-furfurylamino)furazano[3,4-b]pyrazin-6-yl]amine::5-N,6-N-bis(furan-2-ylmethyl)-[1,2,5]oxadiazolo[3,4-b]pyrazine-5,6-diamine::MLS000030610::N,N'-Bis-furan-2-ylmethyl-[1,2,5]oxadiazolo[3,4-b]pyrazine-5,6-diamine::N5,N6-bis(2-furanylmethyl)-[1,2,5]oxadiazolo[3,4-b]pyrazine-5,6-diamine::N5,N6-bis(furan-2-ylmethyl)-[1,2,5]oxadiazolo[3,4-b]pyrazine-5,6-diamine::SMR000001239::cid_653216
SMILES C(Nc1nc2nonc2nc1NCc1ccco1)c1ccco1
InChI Key InChIKey=CJKDOKMUFJIOEB-UHFFFAOYSA-N
Data  1 EC50
  Tab Delimited (TSV)   2D SDfile   Computed 3D by Vconf -m prep SDfile
Find this compound or compounds like it in BindingDB:
Activity Spreadsheet -- Enzyme Inhibition Constant Data from BindingDB
Found 1 hit for monomerid = 47514
TargetSolute carrier family 12 member 5(Homo sapiens (Human))
Vanderbilt Screening Center For Gpcrs, Ion Channels And Transporters
Curated by PubChem BioAssay
LigandPNGBDBM47514(2-furfuryl-[5-(2-furfurylamino)furazano[3,4-b]pyra...)
Affinity DataEC50:  4.37E+4nM. Assay description: Vanderbilt Screening Center for GPCRs, Ion Channels and Transporters Assay Provider: Eric Delpire Assay Provider Affliation: Vanderbilt University Gr...
In DepthDetails PCBioAssay