BDBM47539 6-[2-[3-(4-ethylphenyl)-4-oxidanylidene-quinazolin-2-yl]sulfanylethanoyl]-4H-1,4-benzoxazin-3-one::6-[2-[3-(4-ethylphenyl)-4-oxoquinazolin-2-yl]sulfanylacetyl]-4H-1,4-benzoxazin-3-one::6-[2-[[3-(4-ethylphenyl)-4-keto-quinazolin-2-yl]thio]acetyl]-4H-1,4-benzoxazin-3-one::6-[2-[[3-(4-ethylphenyl)-4-oxo-2-quinazolinyl]thio]-1-oxoethyl]-4H-1,4-benzoxazin-3-one::MLS000390138::SMR000259402::cid_2346532
SMILES CCc1ccc(cc1)-n1c(SCC(=O)c2ccc3OCC(=O)Nc3c2)nc2ccccc2c1=O
InChI Key InChIKey=DAEMVVQUKLJNSP-UHFFFAOYSA-N
Data  1 EC50
  Tab Delimited (TSV)   2D SDfile   Computed 3D by Vconf -m prep SDfile
Find this compound or compounds like it in BindingDB:
Activity Spreadsheet -- Enzyme Inhibition Constant Data from BindingDB
Found 1 hit for monomerid = 47539
TargetSolute carrier family 12 member 5(Homo sapiens (Human))
Vanderbilt Screening Center For Gpcrs, Ion Channels And Transporters
Curated by PubChem BioAssay
LigandPNGBDBM47539(6-[2-[3-(4-ethylphenyl)-4-oxidanylidene-quinazolin...)
Affinity DataEC50:  5.18E+4nM. Assay description: Vanderbilt Screening Center for GPCRs, Ion Channels and Transporters Assay Provider: Eric Delpire Assay Provider Affliation: Vanderbilt University Gr...
In DepthDetails PCBioAssay