BDBM47580 (2E)-2-(5-ethoxy-1-methyl-2-oxo-1,2-dihydro-3H-indol-3-ylidene)hydrazinecarboximidamide::2-[(Z)-(5-ethoxy-1-methyl-2-oxidanylidene-indol-3-ylidene)amino]guanidine::2-[(Z)-(5-ethoxy-1-methyl-2-oxo-3-indolylidene)amino]guanidine::2-[(Z)-(5-ethoxy-1-methyl-2-oxoindol-3-ylidene)amino]guanidine::2-[(Z)-(5-ethoxy-2-keto-1-methyl-indolin-3-ylidene)amino]guanidine::MLS000585573::SMR000207554::cid_12004449
SMILES [#6]-[#6]-[#8]-c1ccc2-[#7](-[#6])-[#6](=O)-[#6](=[#7]\[#7]=[#6](\[#7])-[#7])-c2c1
InChI Key InChIKey=SHDPYLDRVGEJBW-UHFFFAOYSA-N
Data  1 EC50
  Tab Delimited (TSV)   2D SDfile   Computed 3D by Vconf -m prep SDfile
Find this compound or compounds like it in BindingDB:
Activity Spreadsheet -- Enzyme Inhibition Constant Data from BindingDB
Found 1 hit for monomerid = 47580
TargetGlutathione S-transferase Mu 1(Homo sapiens (Human))
Nmmlsc
Curated by PubChem BioAssay
LigandPNGBDBM47580((2E)-2-(5-ethoxy-1-methyl-2-oxo-1,2-dihydro-3H-ind...)
Affinity DataEC50:  2.56E+4nM. Assay description: University of New Mexico Assay Overview: Assay Support: NIH I RO3 MH081231-01 HTS to identify specific small molecule inhibitors of Ras and Ras-re...
Ligand InfoPC cidPC sid
In DepthDetails PCBioAssay