BDBM47629 MLS000711688::N'-[2,5-dimethoxy-4-(2-thenoylamino)phenyl]-N-(6-quinolyl)succinamide::N'-[2,5-dimethoxy-4-(thiophen-2-ylcarbonylamino)phenyl]-N-quinolin-6-yl-butanediamide::N'-[2,5-dimethoxy-4-(thiophene-2-carbonylamino)phenyl]-N-quinolin-6-ylbutanediamide::N'-[2,5-dimethoxy-4-[[oxo(thiophen-2-yl)methyl]amino]phenyl]-N-(6-quinolinyl)butanediamide::SMR000281455::cid_1139085
SMILES COc1cc(NC(=O)c2cccs2)c(OC)cc1NC(=O)CCC(=O)Nc1ccc2ncccc2c1
InChI Key InChIKey=FZVXWAHFKBVEJA-UHFFFAOYSA-N
Data  1 IC50  1 EC50
  Tab Delimited (TSV)   2D SDfile   Computed 3D by Vconf -m prep SDfile
Find this compound or compounds like it in BindingDB:
Activity Spreadsheet -- Enzyme Inhibition Constant Data from BindingDB
Found 2 hits for monomerid = 47629
TargetKallikrein-5(Homo sapiens (Human))
Pcmd
Curated by PubChem BioAssay
LigandPNGBDBM47629(MLS000711688 | N'-[2,5-dimethoxy-4-(2-thenoylamino...)
Affinity DataIC50:  5.00E+4nM. Assay description: Molecular Library Screening Center Network (MLSCN) Penn Center for Molecular Discovery (PCMD) Assay Provider: Scott L. Diamond, University of Pennsy...
In DepthDetails PCBioAssay
TargetGlutathione S-transferase Mu 1(Homo sapiens (Human))
Nmmlsc
Curated by PubChem BioAssay
LigandPNGBDBM47629(MLS000711688 | N'-[2,5-dimethoxy-4-(2-thenoylamino...)
Affinity DataEC50:  481nM. Assay description: University of New Mexico Assay Overview: Assay Support: NIH I RO3 MH081231-01 HTS to identify specific small molecule inhibitors of Ras and Ras-re...
In DepthDetails PCBioAssay