BDBM47647 5-bromo-2-furaldehyde (1,1-dioxido-1,2-benzisothiazol-3-yl)(methyl)hydrazone::MLS000682944::N-[(5-bromanylfuran-2-yl)methylideneamino]-N-methyl-1,1-bis(oxidanylidene)-1,2-benzothiazol-3-amine::N-[(5-bromo-2-furanyl)methylideneamino]-N-methyl-1,1-dioxo-1,2-benzothiazol-3-amine::N-[(5-bromofuran-2-yl)methylideneamino]-N-methyl-1,1-dioxo-1,2-benzothiazol-3-amine::SMR000313027::[(5-bromo-2-furyl)methyleneamino]-(1,1-diketo-1,2-benzothiazol-3-yl)-methyl-amine::cid_4312765
SMILES CN(N=Cc1ccc(Br)o1)C1=NS(=O)(=O)c2ccccc12
InChI Key InChIKey=XEJJWUOFCRVCBE-UHFFFAOYSA-N
Data  1 EC50
  Tab Delimited (TSV)   2D SDfile   Computed 3D by Vconf -m prep SDfile
Find this compound or compounds like it in BindingDB:
Activity Spreadsheet -- Enzyme Inhibition Constant Data from BindingDB
Found 1 hit for monomerid = 47647
TargetGlutathione S-transferase Mu 1(Homo sapiens (Human))
Nmmlsc
Curated by PubChem BioAssay
LigandPNGBDBM47647(5-bromo-2-furaldehyde (1,1-dioxido-1,2-benzisothia...)
Affinity DataEC50:  184nM. Assay description: University of New Mexico Assay Overview: Assay Support: NIH I RO3 MH081231-01 HTS to identify specific small molecule inhibitors of Ras and Ras-re...
In DepthDetails PCBioAssay