BDBM47752 4-[(2-chloranyl-5-nitro-phenyl)methylideneamino]-3-(5-methyl-1H-pyrazol-3-yl)-1H-1,2,4-triazole-5-thione::4-[(2-chloro-5-nitro-benzylidene)amino]-3-(5-methyl-1H-pyrazol-3-yl)-1H-1,2,4-triazole-5-thione::4-[(2-chloro-5-nitrophenyl)methylideneamino]-3-(5-methyl-1H-pyrazol-3-yl)-1H-1,2,4-triazole-5-thione::4-{[1-(2-Chloro-5-nitro-phenyl)-meth-(E)-ylidene]-amino}-5-(5-methyl-2H-pyrazol-3-yl)-4H-[1,2,4]triazole-3-thiol::MLS000331388::SMR000220892::cid_3741800
SMILES Cc1cc(n[nH]1)-c1n[nH]c(=S)n1[N-][CH+]c1cc(ccc1Cl)[N+]([O-])=O
InChI Key InChIKey=AOQJSHAJGFWZGF-UHFFFAOYSA-N
Data  1 IC50  5 EC50
  Tab Delimited (TSV)   2D SDfile   Computed 3D by Vconf -m prep SDfile
Find this compound or compounds like it in BindingDB:
Activity Spreadsheet -- Enzyme Inhibition Constant Data from BindingDB
Found 6 hits for monomerid = 47752
TargetRegulator of G-protein signaling 8(Homo sapiens (Human))
Nmmlsc
Curated by PubChem BioAssay
LigandPNGBDBM47752(4-[(2-chloranyl-5-nitro-phenyl)methylideneamino]-3...)
Affinity DataEC50: >3.00E+4nM. Assay description: University of New Mexico Assay Overview: Assay Support: NIH R21NS057014 HTS to identify small molecule regulators of RGS family protein interaction...
In DepthDetails PCBioAssay
TargetRegulator of G-protein signaling 7(Homo sapiens (Human))
Nmmlsc
Curated by PubChem BioAssay
LigandPNGBDBM47752(4-[(2-chloranyl-5-nitro-phenyl)methylideneamino]-3...)
Affinity DataEC50: >3.00E+4nM. Assay description: University of New Mexico Assay Overview: Assay Support: NIH R21NS057014 HTS to identify small molecule regulators of RGS family protein interaction...
In DepthDetails PCBioAssay
TargetKallikrein-5(Homo sapiens (Human))
Pcmd
Curated by PubChem BioAssay
LigandPNGBDBM47752(4-[(2-chloranyl-5-nitro-phenyl)methylideneamino]-3...)
Affinity DataIC50:  5.00E+4nM. Assay description: Molecular Library Screening Center Network (MLSCN) Penn Center for Molecular Discovery (PCMD) Assay Provider: Scott L. Diamond, University of Pennsy...
In DepthDetails PCBioAssay
TargetRegulator of G-protein signaling 16(Homo sapiens (Human))
Nmmlsc
Curated by PubChem BioAssay
LigandPNGBDBM47752(4-[(2-chloranyl-5-nitro-phenyl)methylideneamino]-3...)
Affinity DataEC50: >3.00E+4nM. Assay description: University of New Mexico Assay Overview: Assay Support: NIH R21NS057014 HTS to identify small molecule regulators of RGS family protein interaction...
In DepthDetails PCBioAssay
TargetRegulator of G-protein signaling 4(Homo sapiens (Human))
Nmmlsc
Curated by PubChem BioAssay
LigandPNGBDBM47752(4-[(2-chloranyl-5-nitro-phenyl)methylideneamino]-3...)
Affinity DataEC50:  3.00E+4nM. Assay description: University of New Mexico Assay Overview: Assay Support: NIH R21NS057014 HTS to identify small molecule regulators of RGS family protein interaction...
In DepthDetails PCBioAssay
TargetRegulator of G-protein signaling 19(Homo sapiens (Human))
Nmmlsc
Curated by PubChem BioAssay
LigandPNGBDBM47752(4-[(2-chloranyl-5-nitro-phenyl)methylideneamino]-3...)
Affinity DataEC50: >3.00E+4nM. Assay description: University of New Mexico Assay Overview: Assay Support: NIH R21NS057014 HTS to identify small molecule regulators of RGS family protein interaction...
In DepthDetails PCBioAssay