BDBM47781 5-[4-[hydroxy(diphenyl)methyl]-1-piperidinyl]-5-oxopentanoic acid::5-[4-[hydroxy(diphenyl)methyl]piperidin-1-yl]-5-oxopentanoic acid::5-[4-[hydroxy(diphenyl)methyl]piperidino]-5-keto-valeric acid::5-[4-[oxidanyl(diphenyl)methyl]piperidin-1-yl]-5-oxidanylidene-pentanoic acid::MLS000715040::SMR000275019::cid_1074070
SMILES OC(=O)CCCC(=O)N1CCC(CC1)C(O)(c1ccccc1)c1ccccc1
InChI Key InChIKey=PKRFRRKXACIAGA-UHFFFAOYSA-N
Data  5 EC50
  Tab Delimited (TSV)   2D SDfile   Computed 3D by Vconf -m prep SDfile
Find this compound or compounds like it in BindingDB:
Activity Spreadsheet -- Enzyme Inhibition Constant Data from BindingDB
Found 5 hits for monomerid = 47781
TargetRegulator of G-protein signaling 8(Homo sapiens (Human))
Nmmlsc
Curated by PubChem BioAssay
LigandPNGBDBM47781(5-[4-[hydroxy(diphenyl)methyl]-1-piperidinyl]-5-ox...)
Affinity DataEC50: >3.00E+4nM. Assay description: University of New Mexico Assay Overview: Assay Support: NIH R21NS057014 HTS to identify small molecule regulators of RGS family protein interaction...
In DepthDetails PCBioAssay
TargetRegulator of G-protein signaling 7(Homo sapiens (Human))
Nmmlsc
Curated by PubChem BioAssay
LigandPNGBDBM47781(5-[4-[hydroxy(diphenyl)methyl]-1-piperidinyl]-5-ox...)
Affinity DataEC50: >3.00E+4nM. Assay description: University of New Mexico Assay Overview: Assay Support: NIH R21NS057014 HTS to identify small molecule regulators of RGS family protein interaction...
In DepthDetails PCBioAssay
TargetRegulator of G-protein signaling 4(Homo sapiens (Human))
Nmmlsc
Curated by PubChem BioAssay
LigandPNGBDBM47781(5-[4-[hydroxy(diphenyl)methyl]-1-piperidinyl]-5-ox...)
Affinity DataEC50:  3.00E+4nM. Assay description: University of New Mexico Assay Overview: Assay Support: NIH R21NS057014 HTS to identify small molecule regulators of RGS family protein interaction...
In DepthDetails PCBioAssay
TargetRegulator of G-protein signaling 16(Homo sapiens (Human))
Nmmlsc
Curated by PubChem BioAssay
LigandPNGBDBM47781(5-[4-[hydroxy(diphenyl)methyl]-1-piperidinyl]-5-ox...)
Affinity DataEC50: >3.00E+4nM. Assay description: University of New Mexico Assay Overview: Assay Support: NIH R21NS057014 HTS to identify small molecule regulators of RGS family protein interaction...
In DepthDetails PCBioAssay
TargetRegulator of G-protein signaling 19(Homo sapiens (Human))
Nmmlsc
Curated by PubChem BioAssay
LigandPNGBDBM47781(5-[4-[hydroxy(diphenyl)methyl]-1-piperidinyl]-5-ox...)
Affinity DataEC50: >3.00E+4nM. Assay description: University of New Mexico Assay Overview: Assay Support: NIH R21NS057014 HTS to identify small molecule regulators of RGS family protein interaction...
In DepthDetails PCBioAssay