BDBM47799 2-(benzenesulfonyl)-N-[4-(2-pyrimidinylsulfamoyl)phenyl]acetamide::2-(benzenesulfonyl)-N-[4-(pyrimidin-2-ylsulfamoyl)phenyl]acetamide::2-(phenylsulfonyl)-N-[4-(pyrimidin-2-ylsulfamoyl)phenyl]ethanamide::2-besyl-N-[4-(2-pyrimidylsulfamoyl)phenyl]acetamide::MLS000716743::SMR000278260::cid_4428810
SMILES O=C(CS(=O)(=O)c1ccccc1)Nc1ccc(cc1)S(=O)(=O)Nc1ncccn1
InChI Key InChIKey=BIUGRXQWPUAZKJ-UHFFFAOYSA-N
Data  5 EC50
  Tab Delimited (TSV)   2D SDfile   Computed 3D by Vconf -m prep SDfile
Find this compound or compounds like it in BindingDB:
Activity Spreadsheet -- Enzyme Inhibition Constant Data from BindingDB
Found 5 hits for monomerid = 47799
TargetRegulator of G-protein signaling 8(Homo sapiens (Human))
Nmmlsc
Curated by PubChem BioAssay
LigandPNGBDBM47799(2-(benzenesulfonyl)-N-[4-(2-pyrimidinylsulfamoyl)p...)
Affinity DataEC50: >3.00E+4nM. Assay description: University of New Mexico Assay Overview: Assay Support: NIH R21NS057014 HTS to identify small molecule regulators of RGS family protein interaction...
In DepthDetails PCBioAssay
TargetRegulator of G-protein signaling 7(Homo sapiens (Human))
Nmmlsc
Curated by PubChem BioAssay
LigandPNGBDBM47799(2-(benzenesulfonyl)-N-[4-(2-pyrimidinylsulfamoyl)p...)
Affinity DataEC50: >3.00E+4nM. Assay description: University of New Mexico Assay Overview: Assay Support: NIH R21NS057014 HTS to identify small molecule regulators of RGS family protein interaction...
In DepthDetails PCBioAssay
TargetRegulator of G-protein signaling 4(Homo sapiens (Human))
Nmmlsc
Curated by PubChem BioAssay
LigandPNGBDBM47799(2-(benzenesulfonyl)-N-[4-(2-pyrimidinylsulfamoyl)p...)
Affinity DataEC50:  3.00E+4nM. Assay description: University of New Mexico Assay Overview: Assay Support: NIH R21NS057014 HTS to identify small molecule regulators of RGS family protein interaction...
In DepthDetails PCBioAssay
TargetRegulator of G-protein signaling 16(Homo sapiens (Human))
Nmmlsc
Curated by PubChem BioAssay
LigandPNGBDBM47799(2-(benzenesulfonyl)-N-[4-(2-pyrimidinylsulfamoyl)p...)
Affinity DataEC50: >3.00E+4nM. Assay description: University of New Mexico Assay Overview: Assay Support: NIH R21NS057014 HTS to identify small molecule regulators of RGS family protein interaction...
In DepthDetails PCBioAssay
TargetRegulator of G-protein signaling 19(Homo sapiens (Human))
Nmmlsc
Curated by PubChem BioAssay
LigandPNGBDBM47799(2-(benzenesulfonyl)-N-[4-(2-pyrimidinylsulfamoyl)p...)
Affinity DataEC50: >3.00E+4nM. Assay description: University of New Mexico Assay Overview: Assay Support: NIH R21NS057014 HTS to identify small molecule regulators of RGS family protein interaction...
In DepthDetails PCBioAssay