BDBM47826 MLS000767196::N-[2-(5-Ethanesulfonyl-3-nitro-thiophen-2-ylsulfanyl)-phenyl]-acetamide::N-[2-(5-ethylsulfonyl-3-nitro-thiophen-2-yl)sulfanylphenyl]ethanamide::N-[2-(5-ethylsulfonyl-3-nitrothiophen-2-yl)sulfanylphenyl]acetamide::N-[2-[(5-esyl-3-nitro-2-thienyl)thio]phenyl]acetamide::N-[2-[(5-ethylsulfonyl-3-nitro-2-thiophenyl)thio]phenyl]acetamide::SMR000429517::cid_1583996
SMILES CCS(=O)(=O)c1cc(c(Sc2ccccc2NC(C)=O)s1)[N+]([O-])=O
InChI Key InChIKey=OKVRGQTUBLAZKQ-UHFFFAOYSA-N
Data  5 EC50
  Tab Delimited (TSV)   2D SDfile   Computed 3D by Vconf -m prep SDfile
Find this compound or compounds like it in BindingDB:
Activity Spreadsheet -- Enzyme Inhibition Constant Data from BindingDB
Found 5 hits for monomerid = 47826
TargetRegulator of G-protein signaling 8(Homo sapiens (Human))
Nmmlsc
Curated by PubChem BioAssay
LigandPNGBDBM47826(MLS000767196 | N-[2-(5-Ethanesulfonyl-3-nitro-thio...)
Affinity DataEC50: >3.00E+4nM. Assay description: University of New Mexico Assay Overview: Assay Support: NIH R21NS057014 HTS to identify small molecule regulators of RGS family protein interaction...
In DepthDetails PCBioAssay
TargetRegulator of G-protein signaling 7(Homo sapiens (Human))
Nmmlsc
Curated by PubChem BioAssay
LigandPNGBDBM47826(MLS000767196 | N-[2-(5-Ethanesulfonyl-3-nitro-thio...)
Affinity DataEC50: >3.00E+4nM. Assay description: University of New Mexico Assay Overview: Assay Support: NIH R21NS057014 HTS to identify small molecule regulators of RGS family protein interaction...
In DepthDetails PCBioAssay
TargetRegulator of G-protein signaling 4(Homo sapiens (Human))
Nmmlsc
Curated by PubChem BioAssay
LigandPNGBDBM47826(MLS000767196 | N-[2-(5-Ethanesulfonyl-3-nitro-thio...)
Affinity DataEC50:  3.00E+4nM. Assay description: University of New Mexico Assay Overview: Assay Support: NIH R21NS057014 HTS to identify small molecule regulators of RGS family protein interaction...
In DepthDetails PCBioAssay
TargetRegulator of G-protein signaling 16(Homo sapiens (Human))
Nmmlsc
Curated by PubChem BioAssay
LigandPNGBDBM47826(MLS000767196 | N-[2-(5-Ethanesulfonyl-3-nitro-thio...)
Affinity DataEC50: >3.00E+4nM. Assay description: University of New Mexico Assay Overview: Assay Support: NIH R21NS057014 HTS to identify small molecule regulators of RGS family protein interaction...
In DepthDetails PCBioAssay
TargetRegulator of G-protein signaling 19(Homo sapiens (Human))
Nmmlsc
Curated by PubChem BioAssay
LigandPNGBDBM47826(MLS000767196 | N-[2-(5-Ethanesulfonyl-3-nitro-thio...)
Affinity DataEC50: >3.00E+4nM. Assay description: University of New Mexico Assay Overview: Assay Support: NIH R21NS057014 HTS to identify small molecule regulators of RGS family protein interaction...
In DepthDetails PCBioAssay