BDBM47834 2-[(4-chlorophenyl)sulfonylmethyl]-1,3-thiazole-4-carbohydrazide::2-[(4-chlorophenyl)sulfonylmethyl]-4-thiazolecarbohydrazide::2-[(4-chlorophenyl)sulfonylmethyl]thiazole-4-carbohydrazide::2-{[(4-chlorophenyl)sulfonyl]methyl}-1,3-thiazole-4-carbohydrazide::MLS000859532::SMR000461309::cid_2743891
SMILES NNC(=O)c1csc(CS(=O)(=O)c2ccc(Cl)cc2)n1
InChI Key InChIKey=LHFIQOGDBKJPTK-UHFFFAOYSA-N
Data  5 EC50
  Tab Delimited (TSV)   2D SDfile   Computed 3D by Vconf -m prep SDfile
Find this compound or compounds like it in BindingDB:
Activity Spreadsheet -- Enzyme Inhibition Constant Data from BindingDB
Found 5 hits for monomerid = 47834
TargetRegulator of G-protein signaling 8(Homo sapiens (Human))
Nmmlsc
Curated by PubChem BioAssay
LigandPNGBDBM47834(2-[(4-chlorophenyl)sulfonylmethyl]-1,3-thiazole-4-...)
Affinity DataEC50: >3.00E+4nM. Assay description: University of New Mexico Assay Overview: Assay Support: NIH R21NS057014 HTS to identify small molecule regulators of RGS family protein interaction...
In DepthDetails PCBioAssay
TargetRegulator of G-protein signaling 7(Homo sapiens (Human))
Nmmlsc
Curated by PubChem BioAssay
LigandPNGBDBM47834(2-[(4-chlorophenyl)sulfonylmethyl]-1,3-thiazole-4-...)
Affinity DataEC50: >3.00E+4nM. Assay description: University of New Mexico Assay Overview: Assay Support: NIH R21NS057014 HTS to identify small molecule regulators of RGS family protein interaction...
In DepthDetails PCBioAssay
TargetRegulator of G-protein signaling 4(Homo sapiens (Human))
Nmmlsc
Curated by PubChem BioAssay
LigandPNGBDBM47834(2-[(4-chlorophenyl)sulfonylmethyl]-1,3-thiazole-4-...)
Affinity DataEC50:  3.00E+4nM. Assay description: University of New Mexico Assay Overview: Assay Support: NIH R21NS057014 HTS to identify small molecule regulators of RGS family protein interaction...
In DepthDetails PCBioAssay
TargetRegulator of G-protein signaling 16(Homo sapiens (Human))
Nmmlsc
Curated by PubChem BioAssay
LigandPNGBDBM47834(2-[(4-chlorophenyl)sulfonylmethyl]-1,3-thiazole-4-...)
Affinity DataEC50: >3.00E+4nM. Assay description: University of New Mexico Assay Overview: Assay Support: NIH R21NS057014 HTS to identify small molecule regulators of RGS family protein interaction...
In DepthDetails PCBioAssay
TargetRegulator of G-protein signaling 19(Homo sapiens (Human))
Nmmlsc
Curated by PubChem BioAssay
LigandPNGBDBM47834(2-[(4-chlorophenyl)sulfonylmethyl]-1,3-thiazole-4-...)
Affinity DataEC50: >3.00E+4nM. Assay description: University of New Mexico Assay Overview: Assay Support: NIH R21NS057014 HTS to identify small molecule regulators of RGS family protein interaction...
In DepthDetails PCBioAssay