BDBM47904 2-cyano-N-[(1,2-diphenyl-3-indolyl)methylideneamino]acetamide::2-cyano-N-[(1,2-diphenylindol-3-yl)methyleneamino]acetamide::2-cyano-N-[(1,2-diphenylindol-3-yl)methylideneamino]acetamide::2-cyano-N-[(1,2-diphenylindol-3-yl)methylideneamino]ethanamide::MLS001177908::SMR000591449::cid_2372936
SMILES O=C(CC#N)NN=Cc1c(-c2ccccc2)n(-c2ccccc2)c2ccccc12
InChI Key InChIKey=JLXVUTBNPFOAPG-UHFFFAOYSA-N
Data  1 IC50
  Tab Delimited (TSV)   2D SDfile   Computed 3D by Vconf -m prep SDfile
Find this compound or compounds like it in BindingDB:
Activity Spreadsheet -- Enzyme Inhibition Constant Data from BindingDB
Found 1 hit for monomerid = 47904
Target3C-like protease(Avian infectious bronchitis virus)
The Scripps Research Institute Molecular Screening Center
Curated by PubChem BioAssay
LigandPNGBDBM47904(2-cyano-N-[(1,2-diphenyl-3-indolyl)methylideneamin...)
Affinity DataIC50: >5.96E+4nM. Assay description: Source (MLPCN Center Name): The Scripps Research Institute Molecular Screening Center (SRIMSC) Center Affiliation: The Scripps Research Institute (TS...
In DepthDetails PCBioAssay