BDBM47912 (2S)-2-[[5-[[4-[(tert-butoxycarbonylamino)methyl]benzyl]carbamoyl]-1H-imidazole-4-carbonyl]amino]-4-methyl-valeric acid tert-butyl ester::(2S)-4-methyl-2-[[[5-[[[4-[[[(2-methylpropan-2-yl)oxy-oxomethyl]amino]methyl]phenyl]methylamino]-oxomethyl]-1H-imidazol-4-yl]-oxomethyl]amino]pentanoic acid tert-butyl ester::ILP-II-36::MLS000834726::SMR000641977::cid_24789267::tert-butyl (2S)-4-methyl-2-[[5-[[4-[[(2-methylpropan-2-yl)oxycarbonylamino]methyl]phenyl]methylcarbamoyl]-1H-imidazol-4-yl]carbonylamino]pentanoate::tert-butyl (2S)-4-methyl-2-[[5-[[4-[[(2-methylpropan-2-yl)oxycarbonylamino]methyl]phenyl]methylcarbamoyl]-1H-imidazole-4-carbonyl]amino]pentanoate
SMILES CC(C)C[C@H](NC(=O)c1nc[nH]c1C(=O)NCc1ccc(CNC(=O)OC(C)(C)C)cc1)C(=O)OC(C)(C)C
InChI Key InChIKey=AORLGWAPCLPIDT-FQEVSTJZSA-N
Data  1 IC50
  Tab Delimited (TSV)   2D SDfile   Computed 3D by Vconf -m prep SDfile
Find this compound or compounds like it in BindingDB:
Activity Spreadsheet -- Enzyme Inhibition Constant Data from BindingDB
Found 1 hit for monomerid = 47912
Target3C-like protease(Avian infectious bronchitis virus)
The Scripps Research Institute Molecular Screening Center
Curated by PubChem BioAssay
LigandPNGBDBM47912((2S)-2-[[5-[[4-[(tert-butoxycarbonylamino)methyl]b...)
Affinity DataIC50: >5.96E+4nM. Assay description: Source (MLPCN Center Name): The Scripps Research Institute Molecular Screening Center (SRIMSC) Center Affiliation: The Scripps Research Institute (TS...
In DepthDetails PCBioAssay