BDBM47933 2-(2-indolin-1-yl-2-keto-ethyl)-1,1-diketo-1,2-benzothiazol-3-one::2-[2-(2,3-dihydro-1H-indol-1-yl)-2-oxoethyl]-1,2-benzisothiazol-3(2H)-one 1,1-dioxide::2-[2-(2,3-dihydroindol-1-yl)-2-oxidanylidene-ethyl]-1,1-bis(oxidanylidene)-1,2-benzothiazol-3-one::2-[2-(2,3-dihydroindol-1-yl)-2-oxoethyl]-1,1-dioxo-1,2-benzothiazol-3-one::MLS000064197::SMR000076164::cid_2202737
SMILES O=C(CN1C(=O)c2ccccc2S1(=O)=O)N1CCc2ccccc12
InChI Key InChIKey=SOBFZOBFFWHUPL-UHFFFAOYSA-N
Data  1 IC50
  Tab Delimited (TSV)   2D SDfile   Computed 3D by Vconf -m prep SDfile
Find this compound or compounds like it in BindingDB:
Activity Spreadsheet -- Enzyme Inhibition Constant Data from BindingDB
Found 1 hit for monomerid = 47933
TargetHeat shock protein HSP 90-alpha(Homo sapiens (Human))
The Scripps Research Institute Molecular Screening Center
Curated by PubChem BioAssay
LigandPNGBDBM47933(2-(2-indolin-1-yl-2-keto-ethyl)-1,1-diketo-1,2-ben...)
Affinity DataIC50:  3.53E+4nM. Assay description: Source (MLPCN Center Name): The Scripps Research Institute Molecular Screening Center (SRIMSC) Center Affiliation: The Scripps Research Institute (TS...
In DepthDetails PCBioAssay