BDBM47947 1-[[2-(4-butoxyphenyl)quinolin-4-yl]carbonylamino]-3-ethyl-thiourea::1-[[2-(4-butoxyphenyl)quinoline-4-carbonyl]amino]-3-ethyl-thiourea::1-[[2-(4-butoxyphenyl)quinoline-4-carbonyl]amino]-3-ethylthiourea::1-[[[2-(4-butoxyphenyl)-4-quinolinyl]-oxomethyl]amino]-3-ethylthiourea::2-{[2-(4-butoxyphenyl)-4-quinolinyl]carbonyl}-N-ethylhydrazinecarbothioamide::MLS000538708::SMR000160169::cid_4194316
SMILES CCCCOc1ccc(cc1)-c1cc(C(=O)NNC(=S)NCC)c2ccccc2n1
InChI Key InChIKey=QHFPXBVJVRYINA-UHFFFAOYSA-N
Data  1 IC50
  Tab Delimited (TSV)   2D SDfile   Computed 3D by Vconf -m prep SDfile
Find this compound or compounds like it in BindingDB:
Activity Spreadsheet -- Enzyme Inhibition Constant Data from BindingDB
Found 1 hit for monomerid = 47947
TargetHeat shock protein HSP 90-alpha(Homo sapiens (Human))
The Scripps Research Institute Molecular Screening Center
Curated by PubChem BioAssay
LigandPNGBDBM47947(1-[[2-(4-butoxyphenyl)quinolin-4-yl]carbonylamino]...)
Affinity DataIC50:  2.45E+3nM. Assay description: Source (MLPCN Center Name): The Scripps Research Institute Molecular Screening Center (SRIMSC) Center Affiliation: The Scripps Research Institute (TS...
In DepthDetails PCBioAssay