BDBM47971 2-[(4-ethoxybenzoyl)amino]thiazole-4-carboxylic acid ethyl ester::2-[[(4-ethoxyphenyl)-oxomethyl]amino]-4-thiazolecarboxylic acid ethyl ester::MLS001004460::SMR000347990::cid_2381436::ethyl 2-[(4-ethoxybenzoyl)amino]-1,3-thiazole-4-carboxylate::ethyl 2-[(4-ethoxyphenyl)carbonylamino]-1,3-thiazole-4-carboxylate
SMILES CCOC(=O)c1csc(NC(=O)c2ccc(OCC)cc2)n1
InChI Key InChIKey=PMQMLXZQOLPKJU-UHFFFAOYSA-N
Data  1 IC50
  Tab Delimited (TSV)   2D SDfile   Computed 3D by Vconf -m prep SDfile
Find this compound or compounds like it in BindingDB:
Activity Spreadsheet -- Enzyme Inhibition Constant Data from BindingDB
Found 1 hit for monomerid = 47971
TargetHeat shock protein HSP 90-alpha(Homo sapiens (Human))
The Scripps Research Institute Molecular Screening Center
Curated by PubChem BioAssay
LigandPNGBDBM47971(2-[(4-ethoxybenzoyl)amino]thiazole-4-carboxylic ac...)
Affinity DataIC50:  880nM. Assay description: Source (MLPCN Center Name): The Scripps Research Institute Molecular Screening Center (SRIMSC) Center Affiliation: The Scripps Research Institute (TS...
In DepthDetails PCBioAssay