BDBM47980 4-keto-3-[2-keto-2-(1,2,5-trimethylpyrrol-3-yl)ethyl]phthalazine-1-carboxylic acid::4-oxidanylidene-3-[2-oxidanylidene-2-(1,2,5-trimethylpyrrol-3-yl)ethyl]phthalazine-1-carboxylic acid::4-oxo-3-[2-oxo-2-(1,2,5-trimethyl-3-pyrrolyl)ethyl]-1-phthalazinecarboxylic acid::4-oxo-3-[2-oxo-2-(1,2,5-trimethylpyrrol-3-yl)ethyl]phthalazine-1-carboxylic acid::MLS000776420::SMR000371394::cid_2080169
SMILES Cc1cc(C(=O)Cn2nc(C(O)=O)c3ccccc3c2=O)c(C)n1C
InChI Key InChIKey=OBJQUEBUWASXNP-UHFFFAOYSA-N
Data  1 IC50
  Tab Delimited (TSV)   2D SDfile   Computed 3D by Vconf -m prep SDfile
Find this compound or compounds like it in BindingDB:
Activity Spreadsheet -- Enzyme Inhibition Constant Data from BindingDB
Found 1 hit for monomerid = 47980
TargetHeat shock protein HSP 90-alpha(Homo sapiens (Human))
The Scripps Research Institute Molecular Screening Center
Curated by PubChem BioAssay
LigandPNGBDBM47980(4-keto-3-[2-keto-2-(1,2,5-trimethylpyrrol-3-yl)eth...)
Affinity DataIC50:  2.34E+4nM. Assay description: Source (MLPCN Center Name): The Scripps Research Institute Molecular Screening Center (SRIMSC) Center Affiliation: The Scripps Research Institute (TS...
In DepthDetails PCBioAssay