BDBM48056 3-amino-N-(2,3-difluorobenzyl)-4,6-dimethyl-thieno[2,3-b]pyridine-2-carboxamide::3-amino-N-[(2,3-difluorophenyl)methyl]-4,6-dimethyl-2-thieno[2,3-b]pyridinecarboxamide::3-amino-N-[(2,3-difluorophenyl)methyl]-4,6-dimethylthieno[2,3-b]pyridine-2-carboxamide::3-azanyl-N-[[2,3-bis(fluoranyl)phenyl]methyl]-4,6-dimethyl-thieno[2,3-b]pyridine-2-carboxamide::VU0402483-1::cid_44176134
SMILES Cc1cc(C)c2c(N)c(sc2n1)C(=O)NCc1cccc(F)c1F
InChI Key InChIKey=GRHMMJHPAWJJGH-UHFFFAOYSA-N
Data  3 EC50
  Tab Delimited (TSV)   2D SDfile   Computed 3D by Vconf -m prep SDfile
Find this compound or compounds like it in BindingDB:
Activity Spreadsheet -- Enzyme Inhibition Constant Data from BindingDB
Found 3 hits for monomerid = 48056
TargetMuscarinic acetylcholine receptor M4(RAT)
Vanderbilt Screening Center For Gpcrs, Ion Channels And Transporters
Curated by PubChem BioAssay
LigandPNGBDBM48056(3-amino-N-(2,3-difluorobenzyl)-4,6-dimethyl-thieno...)
Affinity DataEC50:  0.000973nM. Assay description: Assay Provider: Colleen Niswender Assay Provider Affiliation: Vanderbilt University Grant Title: Discovery of a Highly Selective in vitro and in vivo...
In DepthDetails PCBioAssay
TargetMuscarinic acetylcholine receptor M4(Homo sapiens (Human))
Monash University
Curated by ChEMBL
LigandPNGBDBM48056(3-amino-N-(2,3-difluorobenzyl)-4,6-dimethyl-thieno...)
Affinity DataEC50:  110nM. Assay description: Positive allosteric modulation of human muscarinic M4 receptor expressed in CHO Flp-In cells assessed as stimulation of acetylcholine-induced ERK1/2 ...
In DepthDetails ArticlePubMed
TargetMuscarinic acetylcholine receptor M4(Homo sapiens (Human))
Monash University
Curated by ChEMBL
LigandPNGBDBM48056(3-amino-N-(2,3-difluorobenzyl)-4,6-dimethyl-thieno...)
Affinity DataEC50:  105nM. Assay description: Positive allosteric modulation of human muscarinic M4 receptor expressed in CHO Flp-In cells assessed as stimulation of acetylcholine-induced ERK1/2 ...
In DepthDetails ArticlePubMed