BDBM48097 (8E)-8-(2,3-dihydro-1,4-benzodioxin-6-ylhydrazinylidene)-5-quinolinone::(8E)-8-(2,3-dihydro-1,4-benzodioxin-6-ylhydrazinylidene)quinolin-5-one::(8E)-8-(2,3-dihydro-1,4-benzodioxin-6-ylhydrazono)quinolin-5-one::MLS000774822::SMR000365484::cid_5808003
SMILES Oc1ccc(N=Nc2ccc3OCCOc3c2)c2ncccc12
InChI Key InChIKey=JCDTVGMPPNKKIW-UHFFFAOYSA-N
Data  2 IC50  1 EC50
  Tab Delimited (TSV)   2D SDfile   Computed 3D by Vconf -m prep SDfile
Find this compound or compounds like it in BindingDB:
Activity Spreadsheet -- Enzyme Inhibition Constant Data from BindingDB
Found 3 hits for monomerid = 48097
TargetBeta-galactosidase(Escherichia coli)
Burnham Center For Chemical Genomics
Curated by PubChem BioAssay
LigandPNGBDBM48097((8E)-8-(2,3-dihydro-1,4-benzodioxin-6-ylhydrazinyl...)
Affinity DataEC50:  2.53E+4nM. Assay description: Data Source: Sanford-Burnham Center for Chemical Genomics (SBCCG) Source Affiliation: Sanford-Burnham Medical Research Institute (SBMRI, San Diego, C...
In DepthDetails PCBioAssay
TargetRecBCD enzyme subunit RecD(Escherichia coli str. K-12 substr. MG1655)
The Scripps Research Institute Molecular Screening Center
Curated by PubChem BioAssay
LigandPNGBDBM48097((8E)-8-(2,3-dihydro-1,4-benzodioxin-6-ylhydrazinyl...)
Affinity DataIC50: >1.19E+5nM. Assay description: Source (MLPCN Center Name): The Scripps Research Institute Molecular Screening Center (SRIMSC) Affiliation: The Scripps Research Institute, TSRI Assa...
In DepthDetails PCBioAssay
TargetKappa-type opioid receptor(Homo sapiens (Human))
Burnham Center For Chemical Genomics
Curated by PubChem BioAssay
LigandPNGBDBM48097((8E)-8-(2,3-dihydro-1,4-benzodioxin-6-ylhydrazinyl...)
Affinity DataIC50:  4.93E+3nM. Assay description: Data Source: Sanford-Burnham Center for Chemical Genomics (SBCCG) Source Affiliation: Sanford-Burnham Medical Research Institute (SBMRI, San Diego, C...
In DepthDetails PCBioAssay