BDBM48132 MLS000055504::N-(3-imidazol-1-ylpropyl)-2-[(2,3,5,6-tetramethylphenyl)sulfonylamino]benzamide;hydrochloride::N-[3-(1-imidazolyl)propyl]-2-[(2,3,5,6-tetramethylphenyl)sulfonylamino]benzamide;hydrochloride::SMR000066013::cid_6602839
SMILES Cc1cc(C)c(C)c(c1C)S(=O)(=O)Nc1ccccc1C(=O)NCCCn1ccnc1
InChI Key InChIKey=NVKBEFACMKOJHF-UHFFFAOYSA-N
Data  2 EC50
  Tab Delimited (TSV)   2D SDfile   Computed 3D by Vconf -m prep SDfile
Find this compound or compounds like it in BindingDB:
Activity Spreadsheet -- Enzyme Inhibition Constant Data from BindingDB
Found 2 hits for monomerid = 48132
TargetGlycogen synthase kinase-3 beta(Homo sapiens (Human))
Broad Institute
Curated by PubChem BioAssay
LigandPNGBDBM48132(MLS000055504 | N-(3-imidazol-1-ylpropyl)-2-[(2,3,5...)
Affinity DataEC50: >3.00E+5nM. Assay description: Keywords: GSK3beta, dose response, kinase, inhibition, HTS Assay Overview: The glycogen synthase kinase-3 beta (GSK-3b) is a known master regulator f...
In DepthDetails PCBioAssay
TargetMatrix metalloproteinase-14 [1-36](Homo sapiens (Human))
Sanford-Burnham Center For Chemical Genomics
Curated by PubChem BioAssay
LigandPNGBDBM48132(MLS000055504 | N-(3-imidazol-1-ylpropyl)-2-[(2,3,5...)
Affinity DataEC50:  1.82E+3nM. Assay description: Data Source: Sanford-Burnham Center for Chemical Genomics (SBCCG) Source Affiliation: Sanford-Burnham Medical Research Institute (SBMRI, San Diego, C...
In DepthDetails PCBioAssay