BDBM48156 1,3-benzoxazol-2-yl-(4-methylpyrimidin-2-yl)amine::MLS000115554::N-(4-methyl-2-pyrimidinyl)-1,3-benzoxazol-2-amine::N-(4-methylpyrimidin-2-yl)-1,3-benzoxazol-2-amine::SMR000092635::cid_945758
SMILES Cc1ccnc(Nc2nc3ccccc3o2)n1
InChI Key InChIKey=FPKNCRLNDYNPDD-UHFFFAOYSA-N
Data  1 EC50
  Tab Delimited (TSV)   2D SDfile   Computed 3D by Vconf -m prep SDfile
Find this compound or compounds like it in BindingDB:
Activity Spreadsheet -- Enzyme Inhibition Constant Data from BindingDB
Found 1 hit for monomerid = 48156
TargetMatrix metalloproteinase-14 [1-36](Homo sapiens (Human))
Sanford-Burnham Center For Chemical Genomics
Curated by PubChem BioAssay
LigandPNGBDBM48156(1,3-benzoxazol-2-yl-(4-methylpyrimidin-2-yl)amine ...)
Affinity DataEC50:  1.30E+4nM. Assay description: Data Source: Sanford-Burnham Center for Chemical Genomics (SBCCG) Source Affiliation: Sanford-Burnham Medical Research Institute (SBMRI, San Diego, C...
In DepthDetails PCBioAssay