BDBM48198 4-(5-Pentyl-pyridin-2-yl)-benzoic acid::4-(5-amyl-2-pyridyl)benzoic acid::4-(5-pentyl-2-pyridinyl)benzoic acid::4-(5-pentylpyridin-2-yl)benzoic acid::MLS000035504::SMR000123083::cid_2053671
SMILES CCCCCc1ccc(nc1)-c1ccc(cc1)C(O)=O
InChI Key InChIKey=LLDGJJJHJCIBCL-UHFFFAOYSA-N
Data  2 EC50
  Tab Delimited (TSV)   2D SDfile   Computed 3D by Vconf -m prep SDfile
Find this compound or compounds like it in BindingDB:
Activity Spreadsheet -- Enzyme Inhibition Constant Data from BindingDB
Found 2 hits for monomerid = 48198
TargetTranscription factor p65(Homo sapiens (Human))
Srmlsc
Curated by PubChem BioAssay
LigandPNGBDBM48198(4-(5-Pentyl-pyridin-2-yl)-benzoic acid | 4-(5-amyl...)
Affinity DataEC50:  1.41E+3nM. Assay description: Southern Research Molecular Libraries Screening Center (SRMLSC) Southern Research Institute (Birmingham, Alabama) NIH Molecular Libraries Screening C...
In DepthDetails PCBioAssay
TargetMatrix metalloproteinase-14 [1-36](Homo sapiens (Human))
Sanford-Burnham Center For Chemical Genomics
Curated by PubChem BioAssay
LigandPNGBDBM48198(4-(5-Pentyl-pyridin-2-yl)-benzoic acid | 4-(5-amyl...)
Affinity DataEC50:  3.53E+3nM. Assay description: Data Source: Sanford-Burnham Center for Chemical Genomics (SBCCG) Source Affiliation: Sanford-Burnham Medical Research Institute (SBMRI, San Diego, C...
In DepthDetails PCBioAssay