BDBM48204 2-(1H-Benzoimidazol-5-yl)-benzooxazol-5-ylamine::2-(3H-benzimidazol-5-yl)-1,3-benzoxazol-5-amine::MLS000121646::SMR000119068::[2-(3H-benzimidazol-5-yl)-1,3-benzoxazol-5-yl]amine::cid_784160
SMILES Nc1ccc2oc(nc2c1)-c1ccc2nc[nH]c2c1
InChI Key InChIKey=ZGDMZBQVYDRREE-UHFFFAOYSA-N
Data  1 EC50
  Tab Delimited (TSV)   2D SDfile   Computed 3D by Vconf -m prep SDfile
Find this compound or compounds like it in BindingDB:
Activity Spreadsheet -- Enzyme Inhibition Constant Data from BindingDB
Found 1 hit for monomerid = 48204
TargetMatrix metalloproteinase-14 [1-36](Homo sapiens (Human))
Sanford-Burnham Center For Chemical Genomics
Curated by PubChem BioAssay
LigandPNGBDBM48204(2-(1H-Benzoimidazol-5-yl)-benzooxazol-5-ylamine | ...)
Affinity DataEC50:  4.29E+3nM. Assay description: Data Source: Sanford-Burnham Center for Chemical Genomics (SBCCG) Source Affiliation: Sanford-Burnham Medical Research Institute (SBMRI, San Diego, C...
In DepthDetails PCBioAssay