BDBM48286 MLS000565997::N-(5-methyl-1,3-thiazol-2-yl)-2,3-dihydro-1,4-benzodioxine-3-carboxamide::N-(5-methyl-2-thiazolyl)-2,3-dihydro-1,4-benzodioxin-3-carboxamide::N-(5-methylthiazol-2-yl)-2,3-dihydro-1,4-benzodioxin-3-carboxamide::SMR000153074::cid_3909324
SMILES Cc1cnc(NC(=O)C2COc3ccccc3O2)s1
InChI Key InChIKey=QVQGLHMZODVYNG-UHFFFAOYSA-N
Data  1 EC50
  Tab Delimited (TSV)   2D SDfile   Computed 3D by Vconf -m prep SDfile
Find this compound or compounds like it in BindingDB:
Activity Spreadsheet -- Enzyme Inhibition Constant Data from BindingDB
Found 1 hit for monomerid = 48286
TargetMatrix metalloproteinase-14 [1-36](Homo sapiens (Human))
Sanford-Burnham Center For Chemical Genomics
Curated by PubChem BioAssay
LigandPNGBDBM48286(MLS000565997 | N-(5-methyl-1,3-thiazol-2-yl)-2,3-d...)
Affinity DataEC50:  610nM. Assay description: Data Source: Sanford-Burnham Center for Chemical Genomics (SBCCG) Source Affiliation: Sanford-Burnham Medical Research Institute (SBMRI, San Diego, C...
In DepthDetails PCBioAssay