BDBM483582 US10927079, Compound 48
SMILES Cc1cc(NC(=O)NC2C(O)CC(C)(C)c3cc(F)c(F)cc23)c(nc1-c1ccn(C)n1)-c1ccccc1
InChI Key InChIKey=HKEPTDDWODHGSU-UHFFFAOYSA-N
Data  1 IC50
  Tab Delimited (TSV)   2D SDfile   Computed 3D by Vconf -m prep SDfile
Find this compound or compounds like it in BindingDB:
Activity Spreadsheet -- Enzyme Inhibition Constant Data from BindingDB
Found 1 hit for monomerid = 483582
TargetHigh affinity nerve growth factor receptor(Homo sapiens (Human))
Mochida Pharmaceutical
US Patent
LigandPNGBDBM483582(US10927079, Compound 48)
Affinity DataIC50: <0.100nM. Assay description: Measurement was carried out using TrkA LanthaScreen (registered trademark) Eu Kinase Binding Assay (ThermoFisher SCIENTIFIC). To a 384 well plate (Co...
Ligand InfoPC cidPC sid
In DepthDetails US Patent