BDBM48469 (6E)-5-azanylidene-6-[[5-(furan-2-ylmethylsulfanyl)furan-2-yl]methylidene]-2-propyl-[1,3,4]thiadiazolo[3,2-a]pyrimidin-7-one::(6E)-6-[[5-(2-furanylmethylthio)-2-furanyl]methylidene]-5-imino-2-propyl-[1,3,4]thiadiazolo[3,2-a]pyrimidin-7-one::(6E)-6-[[5-(2-furfurylthio)-2-furyl]methylene]-5-imino-2-propyl-[1,3,4]thiadiazolo[3,2-a]pyrimidin-7-one::(6E)-6-[[5-(furan-2-ylmethylsulfanyl)furan-2-yl]methylidene]-5-imino-2-propyl-[1,3,4]thiadiazolo[3,2-a]pyrimidin-7-one::MLS000521349::SMR000131757::cid_9550113
SMILES CCCC1=NN2C(S1)=NC(=O)\C(=C\c1ccc(SCc3ccco3)o1)C2=N
InChI Key InChIKey=JKRNYSMGLKKINP-ULKQKBTCSA-N
Data  5 IC50
  Tab Delimited (TSV)   2D SDfile   Computed 3D by Vconf -m prep SDfile
Find this compound or compounds like it in BindingDB:
Activity Spreadsheet -- Enzyme Inhibition Constant Data from BindingDB
Found 5 hits for monomerid = 48469
TargetInduced myeloid leukemia cell differentiation protein Mcl-1(Homo sapiens (Human))
Emory University
Curated by PubChem BioAssay
LigandPNGBDBM48469((6E)-5-azanylidene-6-[[5-(furan-2-ylmethylsulfanyl...)
Affinity DataIC50:  3.18E+3nM. Assay description: NIH Molecular Libraries Screening Centers Network [MLSCN] Emory Chemical Biology Discovery Center in MLSCN Assay provider: Nikolovska-Coleska, Univer...
In DepthDetails PCBioAssay
TargetEstrogen receptor beta(Homo sapiens (Human))
Emory University
Curated by PubChem BioAssay
LigandPNGBDBM48469((6E)-5-azanylidene-6-[[5-(furan-2-ylmethylsulfanyl...)
Affinity DataIC50:  5.00E+4nM. Assay description: NIH Molecular Libraries Screening Centers Network [MLSCN] Emory Chemical Biology Discovery Center in MLSCN Assay provider: John A. Katzenellenbogen, ...
In DepthDetails PCBioAssay
Target26S proteasome non-ATPase regulatory subunit 14(Homo sapiens (Human))
Burnham Center For Chemical Genomics
Curated by PubChem BioAssay
LigandPNGBDBM48469((6E)-5-azanylidene-6-[[5-(furan-2-ylmethylsulfanyl...)
Affinity DataIC50:  1.37E+4nM. Assay description: Data Source: Sanford-Burnham Center for Chemical Genomics (SBCCG) Source Affiliation: Sanford Burnham Medical Research Institute (SBMRI, La Jolla, CA...
In DepthDetails PCBioAssay
TargetProthrombin(Bos taurus (Bovine))
Burnham Center For Chemical Genomics
Curated by PubChem BioAssay
LigandPNGBDBM48469((6E)-5-azanylidene-6-[[5-(furan-2-ylmethylsulfanyl...)
Affinity DataIC50:  2.28E+4nM. Assay description: Data Source: Sanford-Burnham Center for Chemical Genomics (SBCCG) Source Affiliation: Sanford Burnham Medical Research Institute (SBMRI, La Jolla, CA...
In DepthDetails PCBioAssay
TargetEstrogen receptor beta(Homo sapiens (Human))
Emory University
Curated by PubChem BioAssay
LigandPNGBDBM48469((6E)-5-azanylidene-6-[[5-(furan-2-ylmethylsulfanyl...)
Affinity DataIC50:  2.65E+3nM. Assay description: NIH Molecular Libraries Screening Centers Network [MLSCN] Emory Chemical Biology Discovery Center in MLSCN Assay provider: John A. Katzenellenbogen, ...
In DepthDetails PCBioAssay