BDBM48642 2-(4-amino-3,5-dichlorophenyl)-3H-benzimidazol-5-amine::2-[4-azanyl-3,5-bis(chloranyl)phenyl]-3H-benzimidazol-5-amine::4-(5-amino-1H-benzimidazol-2-yl)-2,6-dichlorophenylamine::MLS000547609::SMR000114406::[4-(6-amino-1H-benzimidazol-2-yl)-2,6-dichloro-phenyl]amine::cid_762570
SMILES Nc1ccc2nc([nH]c2c1)-c1cc(Cl)c(N)c(Cl)c1
InChI Key InChIKey=FNGQCAMKXURKSA-UHFFFAOYSA-N
Data  1 IC50  2 EC50
  Tab Delimited (TSV)   2D SDfile   Computed 3D by Vconf -m prep SDfile
Find this compound or compounds like it in BindingDB:
Activity Spreadsheet -- Enzyme Inhibition Constant Data from BindingDB
Found 3 hits for monomerid = 48642
TargetEukaryotic translation initiation factor 4 gamma 1(Homo sapiens (Human))
Emory University
Curated by PubChem BioAssay
LigandPNGBDBM48642(2-(4-amino-3,5-dichlorophenyl)-3H-benzimidazol-5-a...)
Affinity DataIC50:  6.40E+4nM. Assay description: Dose Response Confirmation for Small Molecule Inhibitors of Eukaryotic Translation Initiation NIH Molecular Libraries Screening Centers Network [MLSC...
In DepthDetails PCBioAssay
TargetKallikrein-7(Homo sapiens (Human))
The Scripps Research Institute Molecular Screening Center
Curated by PubChem BioAssay
LigandPNGBDBM48642(2-(4-amino-3,5-dichlorophenyl)-3H-benzimidazol-5-a...)
Affinity DataEC50: >6.95E+4nM
In DepthDetails PCBioAssay
TargetStreptokinase A(Streptococcus pyogenes M1 GAS)
Broad Institute
Curated by PubChem BioAssay
LigandPNGBDBM48642(2-(4-amino-3,5-dichlorophenyl)-3H-benzimidazol-5-a...)
Affinity DataEC50:  1.50E+5nM. Assay description: Keywords: Group A streptococcus, GAS, streptokinase, expression, virulence, inhibition, dose response, EC50 Assay Overview: The goal of this assa...
In DepthDetails PCBioAssay