BDBM48687 MLS000552475::N-[1-(2,5-Dimethyl-1-p-tolyl-1H-pyrrol-3-yl)-meth-(E)-ylidene]-N'-(5-nitro-pyridin-2-yl)-hydrazine::N-[[2,5-dimethyl-1-(4-methylphenyl)-3-pyrrolyl]methylideneamino]-5-nitro-2-pyridinamine::N-[[2,5-dimethyl-1-(4-methylphenyl)pyrrol-3-yl]methylideneamino]-5-nitro-pyridin-2-amine::N-[[2,5-dimethyl-1-(4-methylphenyl)pyrrol-3-yl]methylideneamino]-5-nitropyridin-2-amine::SMR000145990::[(E)-[2,5-dimethyl-1-(p-tolyl)pyrrol-3-yl]methyleneamino]-(5-nitro-2-pyridyl)amine::[[2,5-dimethyl-1-(p-tolyl)pyrrol-3-yl]methyleneamino]-(5-nitro-2-pyridyl)amine::cid_4516862
SMILES Cc1cc(CN=Nc2ccc(cn2)[N+]([O-])=O)c(C)n1-c1ccc(C)cc1
InChI Key InChIKey=TYAXNNANFWEBGJ-UHFFFAOYSA-N
Data  3 IC50  2 EC50
  Tab Delimited (TSV)   2D SDfile   Computed 3D by Vconf -m prep SDfile
Find this compound or compounds like it in BindingDB:
Activity Spreadsheet -- Enzyme Inhibition Constant Data from BindingDB
Found 5 hits for monomerid = 48687
TargetEukaryotic translation initiation factor 4 gamma 1(Homo sapiens (Human))
Emory University
Curated by PubChem BioAssay
LigandPNGBDBM48687(MLS000552475 | N-[1-(2,5-Dimethyl-1-p-tolyl-1H-pyr...)
Affinity DataIC50:  6.40E+4nM. Assay description: Dose Response Confirmation for Small Molecule Inhibitors of Eukaryotic Translation Initiation NIH Molecular Libraries Screening Centers Network [MLSC...
In DepthDetails PCBioAssay
TargetTrace amine-associated receptor 1(Homo sapiens (Human))
The Scripps Research Institute Molecular Screening Center
Curated by PubChem BioAssay
LigandPNGBDBM48687(MLS000552475 | N-[1-(2,5-Dimethyl-1-p-tolyl-1H-pyr...)
Affinity DataEC50: >2.99E+4nM
In DepthDetails PCBioAssay
TargetTrace amine-associated receptor 1(Homo sapiens (Human))
The Scripps Research Institute Molecular Screening Center
Curated by PubChem BioAssay
LigandPNGBDBM48687(MLS000552475 | N-[1-(2,5-Dimethyl-1-p-tolyl-1H-pyr...)
Affinity DataIC50:  191nM
In DepthDetails PCBioAssay
TargetGuanine nucleotide-binding protein subunit alpha-15(Homo sapiens (Human))
The Scripps Research Institute Molecular Screening Center
Curated by PubChem BioAssay
LigandPNGBDBM48687(MLS000552475 | N-[1-(2,5-Dimethyl-1-p-tolyl-1H-pyr...)
Affinity DataEC50: >2.99E+4nM
In DepthDetails PCBioAssay
TargetGuanine nucleotide-binding protein subunit alpha-15(Homo sapiens (Human))
The Scripps Research Institute Molecular Screening Center
Curated by PubChem BioAssay
LigandPNGBDBM48687(MLS000552475 | N-[1-(2,5-Dimethyl-1-p-tolyl-1H-pyr...)
Affinity DataIC50: >2.99E+4nM
In DepthDetails PCBioAssay