BDBM48929 2-N-(4-methoxyphenyl)-6-[(1-methyltetrazol-5-yl)sulfanylmethyl]-1,3,5-triazine-2,4-diamine::MLS000084541::N2-(4-methoxyphenyl)-6-[(1-methyl-1,2,3,4-tetrazol-5-yl)sulfanylmethyl]-1,3,5-triazine-2,4-diamine::N2-(4-methoxyphenyl)-6-[[(1-methyl-5-tetrazolyl)thio]methyl]-1,3,5-triazine-2,4-diamine::SMR000047601::[4-amino-6-[[(1-methyltetrazol-5-yl)thio]methyl]-s-triazin-2-yl]-(4-methoxyphenyl)amine::cid_666200
SMILES COc1ccc(Nc2nc(N)nc(CSc3nnnn3C)n2)cc1
InChI Key InChIKey=BMCWMYPABJUJAZ-UHFFFAOYSA-N
Data  1 EC50
  Tab Delimited (TSV)   2D SDfile   Computed 3D by Vconf -m prep SDfile
Find this compound or compounds like it in BindingDB:
Activity Spreadsheet -- Enzyme Inhibition Constant Data from BindingDB
Found 1 hit for monomerid = 48929
TargetD(1B) dopamine receptor(Homo sapiens (Human))
Vanderbilt Screening Center For Gpcrs, Ion Channels And Transporters
Curated by PubChem BioAssay
LigandPNGBDBM48929(2-N-(4-methoxyphenyl)-6-[(1-methyltetrazol-5-yl)su...)
Affinity DataEC50:  0.000516nM. Assay description: Assay Provider: Val Watts Assay Provider Affiliation: Purdue University Grant Title: Allosteric Modulators of D1 Receptors Grant Number: 1 X01 MH0776...
In DepthDetails PCBioAssay