BDBM48936 1-ethyl-5-(ethylthio)-2-phenyl-imidazole;hydrochloride::1-ethyl-5-(ethylthio)-2-phenylimidazole;hydrochloride::1-ethyl-5-ethylsulfanyl-2-phenyl-imidazole;hydrochloride::1-ethyl-5-ethylsulfanyl-2-phenylimidazole;hydrochloride::MLS000055477::SMR000065984::cid_2873386
SMILES CCSc1cnc(-c2ccccc2)n1CC
InChI Key InChIKey=RMVUPVKSDLWVKP-UHFFFAOYSA-N
Data  1 EC50
  Tab Delimited (TSV)   2D SDfile   Computed 3D by Vconf -m prep SDfile
Find this compound or compounds like it in BindingDB:
Activity Spreadsheet -- Enzyme Inhibition Constant Data from BindingDB
Found 1 hit for monomerid = 48936
TargetD(1B) dopamine receptor(Homo sapiens (Human))
Vanderbilt Screening Center For Gpcrs, Ion Channels And Transporters
Curated by PubChem BioAssay
LigandPNGBDBM48936(1-ethyl-5-(ethylthio)-2-phenyl-imidazole;hydrochlo...)
Affinity DataEC50:  0.0249nM. Assay description: Assay Provider: Val Watts Assay Provider Affiliation: Purdue University Grant Title: Allosteric Modulators of D1 Receptors Grant Number: 1 X01 MH0776...
In DepthDetails PCBioAssay